Build check errors found: 2018-08-16

postmaster at open-mesh.org postmaster at open-mesh.org
Thu Aug 16 02:29:00 CEST 2018


Name of failed tests
====================

maint
-----

 * sparse linux-4.18 cfg: BLA=n DAT=n DEBUGFS=y DEBUG=y TRACING=n NC=n MCAST=y BATMAN_V=n
 * sparse linux-4.18 cfg: BLA=n DAT=y DEBUGFS=y DEBUG=y TRACING=n NC=n MCAST=y BATMAN_V=n

master
------

 * coccicheck
 * sparse linux-4.18 cfg: BLA=n DAT=n DEBUGFS=n DEBUG=n TRACING=n NC=y MCAST=y BATMAN_V=n


Output of different failed tests
================================

master: coccicheck
------------------

    Makefile:1595: recipe for target 'coccicheck' failed

maint: sparse linux-4.18 cfg: BLA=n DAT=n DEBUGFS=y DEBUG=y TRACING=n NC=n MCAST=y BATMAN_V=n
---------------------------------------------------------------------------

    ./include/linux/slab.h:631:13: error: undefined identifier '__builtin_mul_overflow'
    ./include/linux/slab.h:631:13: error: not a function <noident>
    ./include/linux/slab.h:631:13: error: not a function <noident>
    ./include/linux/slab.h:631:13: error: not a function <noident>
    ./include/linux/slab.h:631:13: warning: call with no type!
    ./include/linux/slab.h:631:13: error: undefined identifier '__builtin_mul_overflow'
    ./include/linux/slab.h:631:13: error: not a function <noident>
    ./include/linux/slab.h:631:13: warning: call with no type!

maint: sparse linux-4.18 cfg: BLA=n DAT=y DEBUGFS=y DEBUG=y TRACING=n NC=n MCAST=y BATMAN_V=n
---------------------------------------------------------------------------

    ./include/linux/slab.h:631:13: error: undefined identifier '__builtin_mul_overflow'
    ./include/linux/slab.h:631:13: error: not a function <noident>
    ./include/linux/slab.h:631:13: error: not a function <noident>
    ./include/linux/slab.h:631:13: error: not a function <noident>
    ./include/linux/slab.h:631:13: warning: call with no type!
    ./include/linux/slab.h:631:13: error: undefined identifier '__builtin_mul_overflow'
    ./include/linux/slab.h:631:13: warning: call with no type!
    ./include/linux/slab.h:631:13: error: undefined identifier '__builtin_mul_overflow'
    ./include/linux/slab.h:631:13: error: not a function <noident>
    ./include/linux/slab.h:631:13: warning: call with no type!


Statistics
==========

maint
-----

Failed tests:                 2
Started build tests:         45
Tested Linux versions:       20
Tested configs:              42

master
------

Failed tests:                 2
Started build tests:         43
Tested Linux versions:       19
Tested configs:              38



More information about the linux-merge mailing list