Build check errors found: 2018-08-14

postmaster at open-mesh.org postmaster at open-mesh.org
Tue Aug 14 02:29:42 CEST 2018


Name of failed tests
====================

master
------

 * sparse linux-4.18 cfg: BLA=n DAT=y DEBUGFS=y DEBUG=y TRACING=y NC=y MCAST=y BATMAN_V=n
 * sparse linux-4.18 cfg: BLA=y DAT=n DEBUGFS=y DEBUG=n TRACING=n NC=n MCAST=n BATMAN_V=n
 * sparse linux-4.18 cfg: BLA=y DAT=n DEBUGFS=y DEBUG=y TRACING=y NC=y MCAST=y BATMAN_V=y

maint
-----

 * sparse linux-4.18 cfg: BLA=n DAT=n DEBUGFS=n DEBUG=n TRACING=n NC=n MCAST=n BATMAN_V=n
 * sparse linux-4.18 cfg: BLA=n DAT=n DEBUGFS=y DEBUG=y TRACING=n NC=y MCAST=y BATMAN_V=n
 * sparse linux-4.18 cfg: BLA=n DAT=y DEBUGFS=y DEBUG=n TRACING=n NC=n MCAST=n BATMAN_V=n


Output of different failed tests
================================

maint: sparse linux-4.18 cfg: BLA=n DAT=n DEBUGFS=y DEBUG=y TRACING=n NC=y MCAST=y BATMAN_V=n
---------------------------------------------------------------------------

    ./include/linux/slab.h:631:13: error: undefined identifier '__builtin_mul_overflow'
    ./include/linux/slab.h:631:13: error: not a function <noident>
    ./include/linux/slab.h:631:13: error: not a function <noident>
    ./include/linux/slab.h:631:13: error: not a function <noident>
    ./include/linux/slab.h:631:13: warning: call with no type!
    ./include/linux/slab.h:631:13: error: undefined identifier '__builtin_mul_overflow'
    ./include/linux/slab.h:631:13: error: not a function <noident>
    ./include/linux/slab.h:631:13: warning: call with no type!

maint: sparse linux-4.18 cfg: BLA=n DAT=y DEBUGFS=y DEBUG=n TRACING=n NC=n MCAST=n BATMAN_V=n
---------------------------------------------------------------------------

    ./include/linux/slab.h:631:13: error: undefined identifier '__builtin_mul_overflow'
    ./include/linux/slab.h:631:13: error: not a function <noident>
    ./include/linux/slab.h:631:13: error: not a function <noident>
    ./include/linux/slab.h:631:13: error: not a function <noident>
    ./include/linux/slab.h:631:13: warning: call with no type!
    ./include/linux/slab.h:631:13: error: undefined identifier '__builtin_mul_overflow'
    ./include/linux/slab.h:631:13: warning: call with no type!
    ./include/linux/slab.h:631:13: error: undefined identifier '__builtin_mul_overflow'
    ./include/linux/slab.h:631:13: error: not a function <noident>
    ./include/linux/slab.h:631:13: warning: call with no type!


Statistics
==========

master
------

Failed tests:                 3
Started build tests:         41
Tested Linux versions:       22
Tested configs:              39

maint
-----

Failed tests:                 3
Started build tests:         46
Tested Linux versions:       21
Tested configs:              42



More information about the linux-merge mailing list