Build check errors found: 2016-03-01

postmaster at open-mesh.org postmaster at open-mesh.org
Tue Mar 1 01:52:48 CET 2016


Name of failed tests
====================

 * difference between net-next and batadv next
 * headers master
 * sparse master linux-2.6.29 cfg: BLA=n DAT=y DEBUG=n NC=n MCAST=n BATMAN_V=n
 * sparse master linux-2.6.29 cfg: BLA=n DAT=y DEBUG=y NC=n MCAST=y BATMAN_V=n
 * sparse master linux-2.6.29 cfg: BLA=y DAT=n DEBUG=y NC=y MCAST=y BATMAN_V=n
 * sparse master linux-2.6.30 cfg: BLA=n DAT=y DEBUG=n NC=n MCAST=n BATMAN_V=n
 * sparse master linux-2.6.30 cfg: BLA=n DAT=y DEBUG=y NC=n MCAST=y BATMAN_V=n
 * sparse master linux-2.6.30 cfg: BLA=y DAT=n DEBUG=y NC=y MCAST=y BATMAN_V=n
 * sparse master linux-2.6.31 cfg: BLA=n DAT=y DEBUG=n NC=n MCAST=n BATMAN_V=n
 * sparse master linux-2.6.31 cfg: BLA=n DAT=y DEBUG=y NC=n MCAST=y BATMAN_V=n
 * sparse master linux-2.6.31 cfg: BLA=y DAT=n DEBUG=y NC=y MCAST=y BATMAN_V=n
 * sparse master linux-2.6.32 cfg: BLA=n DAT=y DEBUG=n NC=n MCAST=n BATMAN_V=n
 * sparse master linux-2.6.32 cfg: BLA=n DAT=y DEBUG=y NC=n MCAST=y BATMAN_V=n
 * sparse master linux-2.6.32 cfg: BLA=y DAT=n DEBUG=y NC=y MCAST=y BATMAN_V=n
 * sparse master linux-2.6.33 cfg: BLA=n DAT=y DEBUG=n NC=n MCAST=n BATMAN_V=n
 * sparse master linux-2.6.33 cfg: BLA=n DAT=y DEBUG=y NC=n MCAST=y BATMAN_V=n
 * sparse master linux-2.6.33 cfg: BLA=y DAT=n DEBUG=y NC=y MCAST=y BATMAN_V=n
 * sparse master linux-2.6.34 cfg: BLA=n DAT=y DEBUG=n NC=n MCAST=n BATMAN_V=n
 * sparse master linux-2.6.34 cfg: BLA=n DAT=y DEBUG=y NC=n MCAST=y BATMAN_V=n
 * sparse master linux-2.6.34 cfg: BLA=y DAT=n DEBUG=y NC=y MCAST=y BATMAN_V=n
 * sparse master linux-2.6.35 cfg: BLA=n DAT=y DEBUG=n NC=n MCAST=n BATMAN_V=n
 * sparse master linux-2.6.35 cfg: BLA=n DAT=y DEBUG=y NC=n MCAST=y BATMAN_V=n
 * sparse master linux-2.6.35 cfg: BLA=y DAT=n DEBUG=y NC=y MCAST=y BATMAN_V=n
 * sparse master linux-2.6.36 cfg: BLA=n DAT=y DEBUG=n NC=n MCAST=n BATMAN_V=n
 * sparse master linux-2.6.36 cfg: BLA=n DAT=y DEBUG=y NC=n MCAST=y BATMAN_V=n
 * sparse master linux-2.6.36 cfg: BLA=y DAT=n DEBUG=y NC=y MCAST=y BATMAN_V=n
 * sparse master linux-2.6.37 cfg: BLA=n DAT=y DEBUG=n NC=n MCAST=n BATMAN_V=n
 * sparse master linux-2.6.37 cfg: BLA=n DAT=y DEBUG=y NC=n MCAST=y BATMAN_V=n
 * sparse master linux-2.6.37 cfg: BLA=y DAT=n DEBUG=y NC=y MCAST=y BATMAN_V=n
 * sparse master linux-2.6.38 cfg: BLA=n DAT=y DEBUG=n NC=n MCAST=n BATMAN_V=n
 * sparse master linux-2.6.38 cfg: BLA=n DAT=y DEBUG=y NC=n MCAST=y BATMAN_V=n
 * sparse master linux-2.6.38 cfg: BLA=y DAT=n DEBUG=y NC=y MCAST=y BATMAN_V=n
 * sparse master linux-2.6.39 cfg: BLA=n DAT=y DEBUG=n NC=n MCAST=n BATMAN_V=n
 * sparse master linux-2.6.39 cfg: BLA=n DAT=y DEBUG=y NC=n MCAST=y BATMAN_V=n
 * sparse master linux-2.6.39 cfg: BLA=y DAT=n DEBUG=y NC=y MCAST=y BATMAN_V=n
 * sparse master linux-3.0 cfg: BLA=n DAT=y DEBUG=n NC=n MCAST=n BATMAN_V=n
 * sparse master linux-3.0 cfg: BLA=n DAT=y DEBUG=y NC=n MCAST=y BATMAN_V=n
 * sparse master linux-3.0 cfg: BLA=y DAT=n DEBUG=y NC=y MCAST=y BATMAN_V=n
 * sparse master linux-3.1 cfg: BLA=n DAT=y DEBUG=n NC=n MCAST=n BATMAN_V=n
 * sparse master linux-3.1 cfg: BLA=n DAT=y DEBUG=y NC=n MCAST=y BATMAN_V=n
 * sparse master linux-3.1 cfg: BLA=y DAT=n DEBUG=y NC=y MCAST=y BATMAN_V=n
 * sparse next linux-2.6.29 cfg: BLA=n DAT=n DEBUG=y NC=y MCAST=y BATMAN_V=n
 * sparse next linux-2.6.30 cfg: BLA=n DAT=n DEBUG=y NC=y MCAST=y BATMAN_V=n
 * sparse next linux-2.6.31 cfg: BLA=n DAT=n DEBUG=y NC=y MCAST=y BATMAN_V=n
 * sparse next linux-2.6.32 cfg: BLA=n DAT=n DEBUG=y NC=y MCAST=y BATMAN_V=n
 * sparse next linux-2.6.33 cfg: BLA=n DAT=n DEBUG=y NC=y MCAST=y BATMAN_V=n
 * sparse next linux-2.6.34 cfg: BLA=n DAT=n DEBUG=y NC=y MCAST=y BATMAN_V=n
 * sparse next linux-2.6.35 cfg: BLA=n DAT=n DEBUG=y NC=y MCAST=y BATMAN_V=n
 * sparse next linux-2.6.36 cfg: BLA=n DAT=n DEBUG=y NC=y MCAST=y BATMAN_V=n
 * sparse next linux-2.6.37 cfg: BLA=n DAT=n DEBUG=y NC=y MCAST=y BATMAN_V=n
 * sparse next linux-2.6.38 cfg: BLA=n DAT=n DEBUG=y NC=y MCAST=y BATMAN_V=n
 * sparse next linux-2.6.39 cfg: BLA=n DAT=n DEBUG=y NC=y MCAST=y BATMAN_V=n
 * sparse next linux-3.0 cfg: BLA=n DAT=n DEBUG=y NC=y MCAST=y BATMAN_V=n
 * sparse next linux-3.1 cfg: BLA=n DAT=n DEBUG=y NC=y MCAST=y BATMAN_V=n
 * unused_symbols master linux-2.6.29 cfg: BLA=n DAT=y DEBUG=n NC=n MCAST=n BATMAN_V=n
 * unused_symbols master linux-2.6.29 cfg: BLA=n DAT=y DEBUG=y NC=n MCAST=y BATMAN_V=n
 * unused_symbols master linux-2.6.29 cfg: BLA=y DAT=n DEBUG=y NC=y MCAST=y BATMAN_V=n
 * unused_symbols master linux-2.6.30 cfg: BLA=n DAT=y DEBUG=n NC=n MCAST=n BATMAN_V=n
 * unused_symbols master linux-2.6.30 cfg: BLA=n DAT=y DEBUG=y NC=n MCAST=y BATMAN_V=n
 * unused_symbols master linux-2.6.30 cfg: BLA=y DAT=n DEBUG=y NC=y MCAST=y BATMAN_V=n
 * unused_symbols next linux-2.6.29 cfg: BLA=n DAT=n DEBUG=y NC=y MCAST=y BATMAN_V=n
 * unused_symbols next linux-2.6.30 cfg: BLA=n DAT=n DEBUG=y NC=y MCAST=y BATMAN_V=n
 * wrong namespace symbols master linux-2.6.31 cfg: BLA=n DAT=y DEBUG=n NC=n MCAST=n BATMAN_V=n
 * wrong namespace symbols master linux-2.6.31 cfg: BLA=n DAT=y DEBUG=y NC=n MCAST=y BATMAN_V=n
 * wrong namespace symbols master linux-2.6.31 cfg: BLA=y DAT=n DEBUG=y NC=y MCAST=y BATMAN_V=n
 * wrong namespace symbols master linux-2.6.32 cfg: BLA=n DAT=y DEBUG=n NC=n MCAST=n BATMAN_V=n
 * wrong namespace symbols master linux-2.6.32 cfg: BLA=n DAT=y DEBUG=y NC=n MCAST=y BATMAN_V=n
 * wrong namespace symbols master linux-2.6.32 cfg: BLA=y DAT=n DEBUG=y NC=y MCAST=y BATMAN_V=n
 * wrong namespace symbols master linux-2.6.33 cfg: BLA=n DAT=y DEBUG=n NC=n MCAST=n BATMAN_V=n
 * wrong namespace symbols master linux-2.6.33 cfg: BLA=n DAT=y DEBUG=y NC=n MCAST=y BATMAN_V=n
 * wrong namespace symbols master linux-2.6.33 cfg: BLA=y DAT=n DEBUG=y NC=y MCAST=y BATMAN_V=n
 * wrong namespace symbols master linux-2.6.34 cfg: BLA=n DAT=y DEBUG=n NC=n MCAST=n BATMAN_V=n
 * wrong namespace symbols master linux-2.6.34 cfg: BLA=n DAT=y DEBUG=y NC=n MCAST=y BATMAN_V=n
 * wrong namespace symbols master linux-2.6.34 cfg: BLA=y DAT=n DEBUG=y NC=y MCAST=y BATMAN_V=n
 * wrong namespace symbols master linux-2.6.35 cfg: BLA=n DAT=y DEBUG=n NC=n MCAST=n BATMAN_V=n
 * wrong namespace symbols master linux-2.6.35 cfg: BLA=n DAT=y DEBUG=y NC=n MCAST=y BATMAN_V=n
 * wrong namespace symbols master linux-2.6.35 cfg: BLA=y DAT=n DEBUG=y NC=y MCAST=y BATMAN_V=n
 * wrong namespace symbols master linux-2.6.36 cfg: BLA=n DAT=y DEBUG=n NC=n MCAST=n BATMAN_V=n
 * wrong namespace symbols master linux-2.6.36 cfg: BLA=n DAT=y DEBUG=y NC=n MCAST=y BATMAN_V=n
 * wrong namespace symbols master linux-2.6.36 cfg: BLA=y DAT=n DEBUG=y NC=y MCAST=y BATMAN_V=n
 * wrong namespace symbols master linux-2.6.37 cfg: BLA=n DAT=y DEBUG=n NC=n MCAST=n BATMAN_V=n
 * wrong namespace symbols master linux-2.6.37 cfg: BLA=n DAT=y DEBUG=y NC=n MCAST=y BATMAN_V=n
 * wrong namespace symbols master linux-2.6.37 cfg: BLA=y DAT=n DEBUG=y NC=y MCAST=y BATMAN_V=n
 * wrong namespace symbols master linux-2.6.38 cfg: BLA=n DAT=y DEBUG=n NC=n MCAST=n BATMAN_V=n
 * wrong namespace symbols master linux-2.6.38 cfg: BLA=n DAT=y DEBUG=y NC=n MCAST=y BATMAN_V=n
 * wrong namespace symbols master linux-2.6.38 cfg: BLA=y DAT=n DEBUG=y NC=y MCAST=y BATMAN_V=n
 * wrong namespace symbols master linux-2.6.39 cfg: BLA=n DAT=y DEBUG=n NC=n MCAST=n BATMAN_V=n
 * wrong namespace symbols master linux-2.6.39 cfg: BLA=n DAT=y DEBUG=y NC=n MCAST=y BATMAN_V=n
 * wrong namespace symbols master linux-2.6.39 cfg: BLA=y DAT=n DEBUG=y NC=y MCAST=y BATMAN_V=n
 * wrong namespace symbols master linux-3.0 cfg: BLA=n DAT=y DEBUG=n NC=n MCAST=n BATMAN_V=n
 * wrong namespace symbols master linux-3.0 cfg: BLA=n DAT=y DEBUG=y NC=n MCAST=y BATMAN_V=n
 * wrong namespace symbols master linux-3.0 cfg: BLA=y DAT=n DEBUG=y NC=y MCAST=y BATMAN_V=n
 * wrong namespace symbols master linux-3.1 cfg: BLA=n DAT=y DEBUG=n NC=n MCAST=n BATMAN_V=n
 * wrong namespace symbols master linux-3.1 cfg: BLA=n DAT=y DEBUG=y NC=n MCAST=y BATMAN_V=n
 * wrong namespace symbols master linux-3.1 cfg: BLA=y DAT=n DEBUG=y NC=y MCAST=y BATMAN_V=n
 * wrong namespace symbols next linux-2.6.31 cfg: BLA=n DAT=n DEBUG=y NC=y MCAST=y BATMAN_V=n
 * wrong namespace symbols next linux-2.6.32 cfg: BLA=n DAT=n DEBUG=y NC=y MCAST=y BATMAN_V=n
 * wrong namespace symbols next linux-2.6.33 cfg: BLA=n DAT=n DEBUG=y NC=y MCAST=y BATMAN_V=n
 * wrong namespace symbols next linux-2.6.34 cfg: BLA=n DAT=n DEBUG=y NC=y MCAST=y BATMAN_V=n
 * wrong namespace symbols next linux-2.6.35 cfg: BLA=n DAT=n DEBUG=y NC=y MCAST=y BATMAN_V=n
 * wrong namespace symbols next linux-2.6.36 cfg: BLA=n DAT=n DEBUG=y NC=y MCAST=y BATMAN_V=n
 * wrong namespace symbols next linux-2.6.37 cfg: BLA=n DAT=n DEBUG=y NC=y MCAST=y BATMAN_V=n
 * wrong namespace symbols next linux-2.6.38 cfg: BLA=n DAT=n DEBUG=y NC=y MCAST=y BATMAN_V=n
 * wrong namespace symbols next linux-2.6.39 cfg: BLA=n DAT=n DEBUG=y NC=y MCAST=y BATMAN_V=n
 * wrong namespace symbols next linux-3.0 cfg: BLA=n DAT=n DEBUG=y NC=y MCAST=y BATMAN_V=n
 * wrong namespace symbols next linux-3.1 cfg: BLA=n DAT=n DEBUG=y NC=y MCAST=y BATMAN_V=n

Output of different failed tests
================================

difference between net-next and batadv next
-------------------------------------------

     Documentation/ABI/testing/sysfs-class-net-batman-adv |   17 
     net/batman-adv/Kconfig                               |   14 
     net/batman-adv/Makefile                              |    3 
     net/batman-adv/bat_algo.h                            |   28 
     net/batman-adv/bat_iv_ogm.c                          |   11 
     net/batman-adv/bat_v.c                               |  347 ----
     net/batman-adv/bat_v_elp.c                           |  515 ------
     net/batman-adv/bat_v_elp.h                           |   33 
     net/batman-adv/bat_v_ogm.c                           |  833 ----------
     net/batman-adv/bat_v_ogm.h                           |   36 
     net/batman-adv/distributed-arp-table.c               |    4 
     net/batman-adv/fragmentation.c                       |    8 
     net/batman-adv/gateway_common.c                      |    4 
     net/batman-adv/gateway_common.h                      |    2 
     net/batman-adv/icmp_socket.c                         |    2 
     net/batman-adv/main.c                                |    7 
     net/batman-adv/main.h                                |   12 
     net/batman-adv/network-coding.c                      |   22 
     net/batman-adv/packet.h                              |   49 
     net/batman-adv/send.c                                |   55 
     net/batman-adv/send.h                                |   10 
     net/batman-adv/sysfs.c                               |  130 -
     net/batman-adv/types.h                               |   93 -
     23 files changed, 42 insertions(+), 2193 deletions(-)


headers master
--------------

    diff --git a/net/batman-adv/bitarray.h b/net/batman-adv/bitarray.h
    index f93cbc7..9b191bd 100644
    --- a/net/batman-adv/bitarray.h
    +++ b/net/batman-adv/bitarray.h
    @@ -21,6 +21,7 @@
     #include "main.h"
     
     #include <linux/bitops.h>
    +#include <linux/stddef.h>
     #include <linux/compiler.h>
     #include <linux/types.h>
     
    diff --git a/net/batman-adv/soft-interface.h b/net/batman-adv/soft-interface.h
    index 417d30a..adc1c65 100644
    --- a/net/batman-adv/soft-interface.h
    +++ b/net/batman-adv/soft-interface.h
    @@ -18,9 +18,9 @@
     #ifndef _NET_BATMAN_ADV_SOFT_INTERFACE_H_
     #define _NET_BATMAN_ADV_SOFT_INTERFACE_H_
     
    -#include "main.h"
    -
    +#include <linux/types.h>
     #include <net/rtnetlink.h>
    +#include "main.h"
     
     struct net_device;
     struct sk_buff;


sparse next linux-2.6.30 cfg: BLA=n DAT=n DEBUG=y NC=y MCAST=y BATMAN_V=n
-------------------------------------------------------------------------

    In file included from /home/build_test/build_env/tmp/net/batman-adv/soft-interface.c:27:0:
    /home/build_test/build_env/tmp/compat-include/linux/ethtool.h: In function 'batadv_ethtool_get_link_ksettings':
    /home/build_test/build_env/tmp/compat-include/linux/ethtool.h:49:2: error: implicit declaration of function '__ethtool_get_settings' [-Werror=implicit-function-declaration]
      ret = __ethtool_get_settings(dev, &cmd);
      ^
    cc1: some warnings being treated as errors
    make[2]: *** [/home/build_test/build_env/tmp/net/batman-adv/soft-interface.o] Error 1
    make[1]: *** [_module_/home/build_test/build_env/tmp/net/batman-adv] Error 2
    make: *** [all] Error 2


sparse next linux-2.6.33 cfg: BLA=n DAT=n DEBUG=y NC=y MCAST=y BATMAN_V=n
-------------------------------------------------------------------------

    In file included from include/linux/netdevice.h:46:0,
                     from /home/build_test/build_env/tmp/compat-include/linux/netdevice.h:25,
                     from /home/build_test/build_env/tmp/compat.h:44,
                     from <command-line>:0:
    /home/build_test/build_env/tmp/compat-include/linux/ethtool.h: In function 'batadv_ethtool_get_link_ksettings':
    /home/build_test/build_env/tmp/compat-include/linux/ethtool.h:49:2: error: implicit declaration of function '__ethtool_get_settings' [-Werror=implicit-function-declaration]
      ret = __ethtool_get_settings(dev, &cmd);
      ^
    cc1: some warnings being treated as errors
    make[2]: *** [/home/build_test/build_env/tmp/net/batman-adv/bat_iv_ogm.o] Error 1
    make[1]: *** [_module_/home/build_test/build_env/tmp/net/batman-adv] Error 2
    make: *** [all] Error 2


sparse next linux-2.6.34 cfg: BLA=n DAT=n DEBUG=y NC=y MCAST=y BATMAN_V=n
-------------------------------------------------------------------------

    In file included from include/linux/netdevice.h:47:0,
                     from /home/build_test/build_env/tmp/compat-include/linux/netdevice.h:25,
                     from /home/build_test/build_env/tmp/compat.h:44,
                     from <command-line>:0:
    /home/build_test/build_env/tmp/compat-include/linux/ethtool.h: In function 'batadv_ethtool_get_link_ksettings':
    /home/build_test/build_env/tmp/compat-include/linux/ethtool.h:49:2: error: implicit declaration of function '__ethtool_get_settings' [-Werror=implicit-function-declaration]
      ret = __ethtool_get_settings(dev, &cmd);
      ^
    cc1: some warnings being treated as errors
    make[2]: *** [/home/build_test/build_env/tmp/net/batman-adv/bat_iv_ogm.o] Error 1
    make[1]: *** [_module_/home/build_test/build_env/tmp/net/batman-adv] Error 2
    make: *** [all] Error 2


sparse next linux-2.6.35 cfg: BLA=n DAT=n DEBUG=y NC=y MCAST=y BATMAN_V=n
-------------------------------------------------------------------------

    In file included from include/linux/netdevice.h:48:0,
                     from /home/build_test/build_env/tmp/compat-include/linux/netdevice.h:25,
                     from /home/build_test/build_env/tmp/compat.h:44,
                     from <command-line>:0:
    /home/build_test/build_env/tmp/compat-include/linux/ethtool.h: In function 'batadv_ethtool_get_link_ksettings':
    /home/build_test/build_env/tmp/compat-include/linux/ethtool.h:49:2: error: implicit declaration of function '__ethtool_get_settings' [-Werror=implicit-function-declaration]
      ret = __ethtool_get_settings(dev, &cmd);
      ^
    cc1: some warnings being treated as errors
    make[2]: *** [/home/build_test/build_env/tmp/net/batman-adv/bat_iv_ogm.o] Error 1
    make[1]: *** [_module_/home/build_test/build_env/tmp/net/batman-adv] Error 2
    make: *** [all] Error 2


sparse next linux-3.0 cfg: BLA=n DAT=n DEBUG=y NC=y MCAST=y BATMAN_V=n
----------------------------------------------------------------------

    In file included from include/linux/netdevice.h:48:0,
                     from /home/build_test/build_env/tmp/compat-include/linux/netdevice.h:25,
                     from /home/build_test/build_env/tmp/compat.h:52,
                     from <command-line>:0:
    /home/build_test/build_env/tmp/compat-include/linux/ethtool.h: In function 'batadv_ethtool_get_link_ksettings':
    /home/build_test/build_env/tmp/compat-include/linux/ethtool.h:49:2: error: implicit declaration of function '__ethtool_get_settings' [-Werror=implicit-function-declaration]
      ret = __ethtool_get_settings(dev, &cmd);
      ^
    cc1: some warnings being treated as errors
    make[2]: *** [/home/build_test/build_env/tmp/net/batman-adv/bat_iv_ogm.o] Error 1
    make[1]: *** [_module_/home/build_test/build_env/tmp/net/batman-adv] Error 2
    make: *** [all] Error 2


sparse next linux-3.1 cfg: BLA=n DAT=n DEBUG=y NC=y MCAST=y BATMAN_V=n
----------------------------------------------------------------------

    In file included from include/linux/netdevice.h:47:0,
                     from /home/build_test/build_env/tmp/compat-include/linux/netdevice.h:25,
                     from /home/build_test/build_env/tmp/compat.h:52,
                     from <command-line>:0:
    /home/build_test/build_env/tmp/compat-include/linux/ethtool.h: In function 'batadv_ethtool_get_link_ksettings':
    /home/build_test/build_env/tmp/compat-include/linux/ethtool.h:49:2: error: implicit declaration of function '__ethtool_get_settings' [-Werror=implicit-function-declaration]
      ret = __ethtool_get_settings(dev, &cmd);
      ^
    cc1: some warnings being treated as errors
    make[2]: *** [/home/build_test/build_env/tmp/net/batman-adv/bat_iv_ogm.o] Error 1
    make[1]: *** [_module_/home/build_test/build_env/tmp/net/batman-adv] Error 2
    make: *** [all] Error 2


unused_symbols master linux-2.6.30 cfg: BLA=n DAT=y DEBUG=n NC=n MCAST=n BATMAN_V=n
---------------------------------------------------------------------------

    batadv_algo_select
    batadv_dat_snoop_outgoing_arp_reply
    batadv_dat_snoop_outgoing_arp_request
    batadv_dat_status_update
    batadv_debugfs_add_meshif
    batadv_debugfs_del_meshif
    batadv_gw_bandwidth_set
    batadv_gw_dhcp_recipient_get
    batadv_gw_out_of_range
    batadv_gw_tvlv_container_update
    batadv_hardif_disable_interface
    batadv_hardif_enable_interface
    batadv_hardif_min_mtu
    batadv_mesh_free
    batadv_mesh_init
    batadv_orig_node_vlan_get
    batadv_orig_node_vlan_new
    batadv_orig_node_vlan_put
    batadv_routing_algo
    batadv_send_skb_via_gw
    batadv_tvlv_unicast_send
    batadv_update_min_mtu
    batadv_vlan_ap_isola_get
    init_module


unused_symbols master linux-2.6.30 cfg: BLA=n DAT=y DEBUG=y NC=n MCAST=y BATMAN_V=n
---------------------------------------------------------------------------

    batadv_algo_select
    batadv_dat_snoop_outgoing_arp_reply
    batadv_dat_snoop_outgoing_arp_request
    batadv_dat_status_update
    batadv_debugfs_add_meshif
    batadv_debugfs_del_meshif
    batadv_gw_bandwidth_set
    batadv_gw_dhcp_recipient_get
    batadv_gw_out_of_range
    batadv_gw_tvlv_container_update
    batadv_hardif_disable_interface
    batadv_hardif_enable_interface
    batadv_hardif_min_mtu
    batadv_mcast_forw_mode
    batadv_mcast_mla_update
    batadv_mesh_free
    batadv_mesh_init
    batadv_orig_node_vlan_get
    batadv_orig_node_vlan_new
    batadv_orig_node_vlan_put
    batadv_routing_algo
    batadv_send_skb_via_gw
    batadv_tvlv_unicast_send
    batadv_update_min_mtu
    batadv_vlan_ap_isola_get
    init_module


unused_symbols master linux-2.6.30 cfg: BLA=y DAT=n DEBUG=y NC=y MCAST=y BATMAN_V=n
---------------------------------------------------------------------------

    batadv_algo_select
    batadv_bla_is_backbone_gw_orig
    batadv_bla_rx
    batadv_bla_status_update
    batadv_bla_tx
    batadv_debugfs_add_meshif
    batadv_debugfs_del_meshif
    batadv_gw_bandwidth_set
    batadv_gw_dhcp_recipient_get
    batadv_gw_out_of_range
    batadv_gw_tvlv_container_update
    batadv_hardif_disable_interface
    batadv_hardif_enable_interface
    batadv_hardif_min_mtu
    batadv_mcast_forw_mode
    batadv_mcast_mla_update
    batadv_mesh_free
    batadv_mesh_init
    batadv_nc_init_bat_priv
    batadv_nc_status_update
    batadv_orig_node_vlan_get
    batadv_orig_node_vlan_new
    batadv_orig_node_vlan_put
    batadv_routing_algo
    batadv_send_skb_via_gw
    batadv_send_skb_via_tt_generic
    batadv_tvlv_unicast_send
    batadv_update_min_mtu
    batadv_vlan_ap_isola_get
    init_module


unused_symbols next linux-2.6.30 cfg: BLA=n DAT=n DEBUG=y NC=y MCAST=y BATMAN_V=n
---------------------------------------------------------------------------

    batadv_algo_select
    batadv_debugfs_add_meshif
    batadv_debugfs_del_meshif
    batadv_gw_bandwidth_set
    batadv_gw_dhcp_recipient_get
    batadv_gw_out_of_range
    batadv_gw_tvlv_container_update
    batadv_hardif_disable_interface
    batadv_hardif_enable_interface
    batadv_hardif_min_mtu
    batadv_mcast_forw_mode
    batadv_mcast_mla_update
    batadv_mesh_free
    batadv_mesh_init
    batadv_nc_init_bat_priv
    batadv_nc_status_update
    batadv_orig_node_vlan_get
    batadv_orig_node_vlan_new
    batadv_orig_node_vlan_put
    batadv_routing_algo
    batadv_send_skb_via_gw
    batadv_send_skb_via_tt_generic
    batadv_tvlv_unicast_send
    batadv_update_min_mtu
    batadv_vlan_ap_isola_get
    init_module


wrong namespace symbols next linux-3.1 cfg: BLA=n DAT=n DEBUG=y NC=y MCAST=y BATMAN_V=n
---------------------------------------------------------------------------

    nm: './net/batman-adv/*.o': No such file


More information about the linux-merge mailing list