Build check errors found (B.A.T.M.A.N. V): 2016-01-08

postmaster at open-mesh.org postmaster at open-mesh.org
Fri Jan 8 05:39:56 CET 2016


Name of failed tests
====================

 * sparse batman_v linux-3.16 cfg: BLA=n DAT=n DEBUG=y NC=y MCAST=y BATMAN_V=y
 * sparse batman_v linux-3.16 cfg: BLA=n DAT=y DEBUG=n NC=y MCAST=y BATMAN_V=y
 * sparse batman_v linux-3.17 cfg: BLA=n DAT=n DEBUG=y NC=y MCAST=y BATMAN_V=y
 * sparse batman_v linux-3.17 cfg: BLA=n DAT=y DEBUG=n NC=y MCAST=y BATMAN_V=y
 * sparse batman_v linux-3.18 cfg: BLA=n DAT=n DEBUG=y NC=y MCAST=y BATMAN_V=y
 * sparse batman_v linux-3.18 cfg: BLA=n DAT=y DEBUG=n NC=y MCAST=y BATMAN_V=y
 * sparse batman_v linux-3.19 cfg: BLA=n DAT=n DEBUG=y NC=y MCAST=y BATMAN_V=y
 * sparse batman_v linux-3.19 cfg: BLA=n DAT=y DEBUG=n NC=y MCAST=y BATMAN_V=y
 * sparse batman_v linux-4.0 cfg: BLA=n DAT=n DEBUG=y NC=y MCAST=y BATMAN_V=y
 * sparse batman_v linux-4.0 cfg: BLA=n DAT=y DEBUG=n NC=y MCAST=y BATMAN_V=y
 * sparse batman_v linux-4.1 cfg: BLA=n DAT=n DEBUG=y NC=y MCAST=y BATMAN_V=y
 * sparse batman_v linux-4.1 cfg: BLA=n DAT=y DEBUG=n NC=y MCAST=y BATMAN_V=y
 * sparse batman_v linux-4.2 cfg: BLA=n DAT=n DEBUG=y NC=y MCAST=y BATMAN_V=y
 * sparse batman_v linux-4.2 cfg: BLA=n DAT=y DEBUG=n NC=y MCAST=y BATMAN_V=y
 * sparse batman_v linux-4.3 cfg: BLA=n DAT=n DEBUG=y NC=y MCAST=y BATMAN_V=y
 * sparse batman_v linux-4.3 cfg: BLA=n DAT=y DEBUG=n NC=y MCAST=y BATMAN_V=y
 * unused_symbols batman_v linux-3.16 cfg: BLA=n DAT=n DEBUG=y NC=y MCAST=y BATMAN_V=y
 * unused_symbols batman_v linux-3.16 cfg: BLA=n DAT=y DEBUG=n NC=y MCAST=y BATMAN_V=y
 * unused_symbols batman_v linux-3.17 cfg: BLA=n DAT=n DEBUG=y NC=y MCAST=y BATMAN_V=y
 * unused_symbols batman_v linux-3.17 cfg: BLA=n DAT=y DEBUG=n NC=y MCAST=y BATMAN_V=y
 * unused_symbols batman_v linux-3.18 cfg: BLA=n DAT=n DEBUG=y NC=y MCAST=y BATMAN_V=y
 * unused_symbols batman_v linux-3.18 cfg: BLA=n DAT=y DEBUG=n NC=y MCAST=y BATMAN_V=y
 * unused_symbols batman_v linux-3.19 cfg: BLA=n DAT=n DEBUG=y NC=y MCAST=y BATMAN_V=y
 * unused_symbols batman_v linux-3.19 cfg: BLA=n DAT=y DEBUG=n NC=y MCAST=y BATMAN_V=y
 * unused_symbols batman_v linux-4.0 cfg: BLA=n DAT=n DEBUG=y NC=y MCAST=y BATMAN_V=y
 * unused_symbols batman_v linux-4.0 cfg: BLA=n DAT=y DEBUG=n NC=y MCAST=y BATMAN_V=y
 * unused_symbols batman_v linux-4.1 cfg: BLA=n DAT=n DEBUG=y NC=y MCAST=y BATMAN_V=y
 * unused_symbols batman_v linux-4.1 cfg: BLA=n DAT=y DEBUG=n NC=y MCAST=y BATMAN_V=y
 * unused_symbols batman_v linux-4.2 cfg: BLA=n DAT=n DEBUG=y NC=y MCAST=y BATMAN_V=y
 * unused_symbols batman_v linux-4.2 cfg: BLA=n DAT=y DEBUG=n NC=y MCAST=y BATMAN_V=y
 * unused_symbols batman_v linux-4.3 cfg: BLA=n DAT=n DEBUG=y NC=y MCAST=y BATMAN_V=y
 * unused_symbols batman_v linux-4.3 cfg: BLA=n DAT=y DEBUG=n NC=y MCAST=y BATMAN_V=y

Output of different failed tests
================================

sparse batman_v linux-4.3 cfg: BLA=n DAT=n DEBUG=y NC=y MCAST=y BATMAN_V=y
--------------------------------------------------------------------------

    /home/build_test/build_env/tmp/net/batman-adv/bat_v.c:116:17: error: undefined identifier 'batadv_neigh_ifinfo_free_ref'
    /home/build_test/build_env/tmp/net/batman-adv/bat_v.c:231:25: error: undefined identifier 'batadv_neigh_node_free_ref'
    /home/build_test/build_env/tmp/net/batman-adv/bat_v.c:233:33: error: undefined identifier 'batadv_neigh_ifinfo_free_ref'
    /home/build_test/build_env/tmp/net/batman-adv/bat_v.c: In function 'batadv_v_orig_print_neigh':
    /home/build_test/build_env/tmp/net/batman-adv/bat_v.c:116:3: error: implicit declaration of function 'batadv_neigh_ifinfo_free_ref' [-Werror=implicit-function-declaration]
       batadv_neigh_ifinfo_free_ref(n_ifinfo);
       ^
    /home/build_test/build_env/tmp/net/batman-adv/bat_v.c: In function 'batadv_v_orig_print':
    /home/build_test/build_env/tmp/net/batman-adv/bat_v.c:231:4: error: implicit declaration of function 'batadv_neigh_node_free_ref' [-Werror=implicit-function-declaration]
        batadv_neigh_node_free_ref(neigh_node);
        ^
    cc1: some warnings being treated as errors
    make[2]: *** [/home/build_test/build_env/tmp/net/batman-adv/bat_v.o] Error 1
    make[1]: *** [_module_/home/build_test/build_env/tmp/net/batman-adv] Error 2
    make: *** [all] Error 2


unused_symbols batman_v linux-4.3 cfg: BLA=n DAT=n DEBUG=y NC=y MCAST=y BATMAN_V=y
---------------------------------------------------------------------------

    batadv_iv_init


More information about the linux-merge mailing list