Build check errors found: 2015-02-18

postmaster at open-mesh.org postmaster at open-mesh.org
Wed Feb 18 01:47:19 CET 2015


Name of failed tests
====================

bracket_align master debugfs.h
checkpatch master main.c
checkpatch master main.h
checkpatch master network-coding.c
checkpatch master soft-interface.c
checkpatch next main.c
checkpatch next main.h
checkpatch next network-coding.c
checkpatch next soft-interface.c
sparse master linux-2.6.29 CONFIG_BATMAN_ADV_BLA=n CONFIG_BATMAN_ADV_DAT=n CONFIG_BATMAN_ADV_DEBUG=y CONFIG_BATMAN_ADV_NC=n CONFIG_BATMAN_ADV_MCAST=n
sparse master linux-2.6.29 CONFIG_BATMAN_ADV_BLA=n CONFIG_BATMAN_ADV_DAT=n CONFIG_BATMAN_ADV_DEBUG=y CONFIG_BATMAN_ADV_NC=y CONFIG_BATMAN_ADV_MCAST=n
sparse master linux-2.6.29 CONFIG_BATMAN_ADV_BLA=y CONFIG_BATMAN_ADV_DAT=n CONFIG_BATMAN_ADV_DEBUG=n CONFIG_BATMAN_ADV_NC=n CONFIG_BATMAN_ADV_MCAST=n
sparse master linux-2.6.29 CONFIG_BATMAN_ADV_BLA=y CONFIG_BATMAN_ADV_DAT=y CONFIG_BATMAN_ADV_DEBUG=y CONFIG_BATMAN_ADV_NC=y CONFIG_BATMAN_ADV_MCAST=n
sparse master linux-2.6.30 CONFIG_BATMAN_ADV_BLA=n CONFIG_BATMAN_ADV_DAT=n CONFIG_BATMAN_ADV_DEBUG=y CONFIG_BATMAN_ADV_NC=n CONFIG_BATMAN_ADV_MCAST=n
sparse master linux-2.6.30 CONFIG_BATMAN_ADV_BLA=n CONFIG_BATMAN_ADV_DAT=n CONFIG_BATMAN_ADV_DEBUG=y CONFIG_BATMAN_ADV_NC=y CONFIG_BATMAN_ADV_MCAST=n
sparse master linux-2.6.30 CONFIG_BATMAN_ADV_BLA=y CONFIG_BATMAN_ADV_DAT=n CONFIG_BATMAN_ADV_DEBUG=n CONFIG_BATMAN_ADV_NC=n CONFIG_BATMAN_ADV_MCAST=n
sparse master linux-2.6.30 CONFIG_BATMAN_ADV_BLA=y CONFIG_BATMAN_ADV_DAT=y CONFIG_BATMAN_ADV_DEBUG=y CONFIG_BATMAN_ADV_NC=y CONFIG_BATMAN_ADV_MCAST=n
sparse master linux-2.6.31 CONFIG_BATMAN_ADV_BLA=n CONFIG_BATMAN_ADV_DAT=n CONFIG_BATMAN_ADV_DEBUG=y CONFIG_BATMAN_ADV_NC=n CONFIG_BATMAN_ADV_MCAST=n
sparse master linux-2.6.31 CONFIG_BATMAN_ADV_BLA=n CONFIG_BATMAN_ADV_DAT=n CONFIG_BATMAN_ADV_DEBUG=y CONFIG_BATMAN_ADV_NC=y CONFIG_BATMAN_ADV_MCAST=n
sparse master linux-2.6.31 CONFIG_BATMAN_ADV_BLA=y CONFIG_BATMAN_ADV_DAT=n CONFIG_BATMAN_ADV_DEBUG=n CONFIG_BATMAN_ADV_NC=n CONFIG_BATMAN_ADV_MCAST=n
sparse master linux-2.6.31 CONFIG_BATMAN_ADV_BLA=y CONFIG_BATMAN_ADV_DAT=y CONFIG_BATMAN_ADV_DEBUG=y CONFIG_BATMAN_ADV_NC=y CONFIG_BATMAN_ADV_MCAST=n
sparse master linux-2.6.32 CONFIG_BATMAN_ADV_BLA=n CONFIG_BATMAN_ADV_DAT=n CONFIG_BATMAN_ADV_DEBUG=y CONFIG_BATMAN_ADV_NC=n CONFIG_BATMAN_ADV_MCAST=n
sparse master linux-2.6.32 CONFIG_BATMAN_ADV_BLA=n CONFIG_BATMAN_ADV_DAT=n CONFIG_BATMAN_ADV_DEBUG=y CONFIG_BATMAN_ADV_NC=y CONFIG_BATMAN_ADV_MCAST=n
sparse master linux-2.6.32 CONFIG_BATMAN_ADV_BLA=y CONFIG_BATMAN_ADV_DAT=n CONFIG_BATMAN_ADV_DEBUG=n CONFIG_BATMAN_ADV_NC=n CONFIG_BATMAN_ADV_MCAST=n
sparse master linux-2.6.32 CONFIG_BATMAN_ADV_BLA=y CONFIG_BATMAN_ADV_DAT=y CONFIG_BATMAN_ADV_DEBUG=y CONFIG_BATMAN_ADV_NC=y CONFIG_BATMAN_ADV_MCAST=n
sparse master linux-2.6.34 CONFIG_BATMAN_ADV_BLA=n CONFIG_BATMAN_ADV_DAT=n CONFIG_BATMAN_ADV_DEBUG=y CONFIG_BATMAN_ADV_NC=n CONFIG_BATMAN_ADV_MCAST=n
sparse master linux-2.6.34 CONFIG_BATMAN_ADV_BLA=n CONFIG_BATMAN_ADV_DAT=n CONFIG_BATMAN_ADV_DEBUG=y CONFIG_BATMAN_ADV_NC=y CONFIG_BATMAN_ADV_MCAST=n
sparse master linux-2.6.34 CONFIG_BATMAN_ADV_BLA=y CONFIG_BATMAN_ADV_DAT=n CONFIG_BATMAN_ADV_DEBUG=n CONFIG_BATMAN_ADV_NC=n CONFIG_BATMAN_ADV_MCAST=n
sparse master linux-2.6.34 CONFIG_BATMAN_ADV_BLA=y CONFIG_BATMAN_ADV_DAT=y CONFIG_BATMAN_ADV_DEBUG=y CONFIG_BATMAN_ADV_NC=y CONFIG_BATMAN_ADV_MCAST=n
sparse master linux-2.6.35 CONFIG_BATMAN_ADV_BLA=n CONFIG_BATMAN_ADV_DAT=n CONFIG_BATMAN_ADV_DEBUG=y CONFIG_BATMAN_ADV_NC=n CONFIG_BATMAN_ADV_MCAST=n
sparse master linux-2.6.35 CONFIG_BATMAN_ADV_BLA=n CONFIG_BATMAN_ADV_DAT=n CONFIG_BATMAN_ADV_DEBUG=y CONFIG_BATMAN_ADV_NC=y CONFIG_BATMAN_ADV_MCAST=n
sparse master linux-2.6.35 CONFIG_BATMAN_ADV_BLA=y CONFIG_BATMAN_ADV_DAT=n CONFIG_BATMAN_ADV_DEBUG=n CONFIG_BATMAN_ADV_NC=n CONFIG_BATMAN_ADV_MCAST=n
sparse master linux-2.6.35 CONFIG_BATMAN_ADV_BLA=y CONFIG_BATMAN_ADV_DAT=y CONFIG_BATMAN_ADV_DEBUG=y CONFIG_BATMAN_ADV_NC=y CONFIG_BATMAN_ADV_MCAST=n
sparse master linux-2.6.36 CONFIG_BATMAN_ADV_BLA=n CONFIG_BATMAN_ADV_DAT=n CONFIG_BATMAN_ADV_DEBUG=y CONFIG_BATMAN_ADV_NC=n CONFIG_BATMAN_ADV_MCAST=n
sparse master linux-2.6.36 CONFIG_BATMAN_ADV_BLA=n CONFIG_BATMAN_ADV_DAT=n CONFIG_BATMAN_ADV_DEBUG=y CONFIG_BATMAN_ADV_NC=y CONFIG_BATMAN_ADV_MCAST=n
sparse master linux-2.6.36 CONFIG_BATMAN_ADV_BLA=y CONFIG_BATMAN_ADV_DAT=n CONFIG_BATMAN_ADV_DEBUG=n CONFIG_BATMAN_ADV_NC=n CONFIG_BATMAN_ADV_MCAST=n
sparse master linux-2.6.36 CONFIG_BATMAN_ADV_BLA=y CONFIG_BATMAN_ADV_DAT=y CONFIG_BATMAN_ADV_DEBUG=y CONFIG_BATMAN_ADV_NC=y CONFIG_BATMAN_ADV_MCAST=n
sparse master linux-2.6.37 CONFIG_BATMAN_ADV_BLA=n CONFIG_BATMAN_ADV_DAT=n CONFIG_BATMAN_ADV_DEBUG=y CONFIG_BATMAN_ADV_NC=n CONFIG_BATMAN_ADV_MCAST=n
sparse master linux-2.6.37 CONFIG_BATMAN_ADV_BLA=n CONFIG_BATMAN_ADV_DAT=n CONFIG_BATMAN_ADV_DEBUG=y CONFIG_BATMAN_ADV_NC=y CONFIG_BATMAN_ADV_MCAST=n
sparse master linux-2.6.37 CONFIG_BATMAN_ADV_BLA=y CONFIG_BATMAN_ADV_DAT=n CONFIG_BATMAN_ADV_DEBUG=n CONFIG_BATMAN_ADV_NC=n CONFIG_BATMAN_ADV_MCAST=n
sparse master linux-2.6.37 CONFIG_BATMAN_ADV_BLA=y CONFIG_BATMAN_ADV_DAT=y CONFIG_BATMAN_ADV_DEBUG=y CONFIG_BATMAN_ADV_NC=y CONFIG_BATMAN_ADV_MCAST=n
sparse master linux-2.6.38 CONFIG_BATMAN_ADV_BLA=n CONFIG_BATMAN_ADV_DAT=n CONFIG_BATMAN_ADV_DEBUG=y CONFIG_BATMAN_ADV_NC=n CONFIG_BATMAN_ADV_MCAST=n
sparse master linux-2.6.38 CONFIG_BATMAN_ADV_BLA=n CONFIG_BATMAN_ADV_DAT=n CONFIG_BATMAN_ADV_DEBUG=y CONFIG_BATMAN_ADV_NC=y CONFIG_BATMAN_ADV_MCAST=n
sparse master linux-2.6.38 CONFIG_BATMAN_ADV_BLA=y CONFIG_BATMAN_ADV_DAT=n CONFIG_BATMAN_ADV_DEBUG=n CONFIG_BATMAN_ADV_NC=n CONFIG_BATMAN_ADV_MCAST=n
sparse master linux-2.6.38 CONFIG_BATMAN_ADV_BLA=y CONFIG_BATMAN_ADV_DAT=y CONFIG_BATMAN_ADV_DEBUG=y CONFIG_BATMAN_ADV_NC=y CONFIG_BATMAN_ADV_MCAST=n
sparse master linux-2.6.39 CONFIG_BATMAN_ADV_BLA=n CONFIG_BATMAN_ADV_DAT=n CONFIG_BATMAN_ADV_DEBUG=y CONFIG_BATMAN_ADV_NC=n CONFIG_BATMAN_ADV_MCAST=n
sparse master linux-2.6.39 CONFIG_BATMAN_ADV_BLA=n CONFIG_BATMAN_ADV_DAT=n CONFIG_BATMAN_ADV_DEBUG=y CONFIG_BATMAN_ADV_NC=y CONFIG_BATMAN_ADV_MCAST=n
sparse master linux-2.6.39 CONFIG_BATMAN_ADV_BLA=y CONFIG_BATMAN_ADV_DAT=n CONFIG_BATMAN_ADV_DEBUG=n CONFIG_BATMAN_ADV_NC=n CONFIG_BATMAN_ADV_MCAST=n
sparse master linux-2.6.39 CONFIG_BATMAN_ADV_BLA=y CONFIG_BATMAN_ADV_DAT=y CONFIG_BATMAN_ADV_DEBUG=y CONFIG_BATMAN_ADV_NC=y CONFIG_BATMAN_ADV_MCAST=n
sparse master linux-3.0 CONFIG_BATMAN_ADV_BLA=n CONFIG_BATMAN_ADV_DAT=n CONFIG_BATMAN_ADV_DEBUG=y CONFIG_BATMAN_ADV_NC=n CONFIG_BATMAN_ADV_MCAST=n
sparse master linux-3.0 CONFIG_BATMAN_ADV_BLA=n CONFIG_BATMAN_ADV_DAT=n CONFIG_BATMAN_ADV_DEBUG=y CONFIG_BATMAN_ADV_NC=y CONFIG_BATMAN_ADV_MCAST=n
sparse master linux-3.0 CONFIG_BATMAN_ADV_BLA=y CONFIG_BATMAN_ADV_DAT=n CONFIG_BATMAN_ADV_DEBUG=n CONFIG_BATMAN_ADV_NC=n CONFIG_BATMAN_ADV_MCAST=n
sparse master linux-3.0 CONFIG_BATMAN_ADV_BLA=y CONFIG_BATMAN_ADV_DAT=y CONFIG_BATMAN_ADV_DEBUG=y CONFIG_BATMAN_ADV_NC=y CONFIG_BATMAN_ADV_MCAST=n
sparse master linux-3.15 CONFIG_BATMAN_ADV_BLA=n CONFIG_BATMAN_ADV_DAT=n CONFIG_BATMAN_ADV_DEBUG=y CONFIG_BATMAN_ADV_NC=n CONFIG_BATMAN_ADV_MCAST=n
sparse master linux-3.15 CONFIG_BATMAN_ADV_BLA=n CONFIG_BATMAN_ADV_DAT=n CONFIG_BATMAN_ADV_DEBUG=y CONFIG_BATMAN_ADV_NC=y CONFIG_BATMAN_ADV_MCAST=n
sparse master linux-3.15 CONFIG_BATMAN_ADV_BLA=y CONFIG_BATMAN_ADV_DAT=n CONFIG_BATMAN_ADV_DEBUG=n CONFIG_BATMAN_ADV_NC=n CONFIG_BATMAN_ADV_MCAST=n
sparse master linux-3.15 CONFIG_BATMAN_ADV_BLA=y CONFIG_BATMAN_ADV_DAT=y CONFIG_BATMAN_ADV_DEBUG=y CONFIG_BATMAN_ADV_NC=y CONFIG_BATMAN_ADV_MCAST=n
sparse next linux-3.15 CONFIG_BATMAN_ADV_BLA=n CONFIG_BATMAN_ADV_DAT=n CONFIG_BATMAN_ADV_DEBUG=n CONFIG_BATMAN_ADV_NC=n CONFIG_BATMAN_ADV_MCAST=n
sparse next linux-3.15 CONFIG_BATMAN_ADV_BLA=n CONFIG_BATMAN_ADV_DAT=y CONFIG_BATMAN_ADV_DEBUG=n CONFIG_BATMAN_ADV_NC=n CONFIG_BATMAN_ADV_MCAST=n
sparse next linux-3.15 CONFIG_BATMAN_ADV_BLA=n CONFIG_BATMAN_ADV_DAT=y CONFIG_BATMAN_ADV_DEBUG=n CONFIG_BATMAN_ADV_NC=y CONFIG_BATMAN_ADV_MCAST=y
sparse next linux-3.15 CONFIG_BATMAN_ADV_BLA=y CONFIG_BATMAN_ADV_DAT=y CONFIG_BATMAN_ADV_DEBUG=y CONFIG_BATMAN_ADV_NC=n CONFIG_BATMAN_ADV_MCAST=y
unused_symbols master linux-2.6.29 CONFIG_BATMAN_ADV_BLA=n CONFIG_BATMAN_ADV_DAT=n CONFIG_BATMAN_ADV_DEBUG=y CONFIG_BATMAN_ADV_NC=n CONFIG_BATMAN_ADV_MCAST=n
unused_symbols master linux-2.6.29 CONFIG_BATMAN_ADV_BLA=n CONFIG_BATMAN_ADV_DAT=n CONFIG_BATMAN_ADV_DEBUG=y CONFIG_BATMAN_ADV_NC=y CONFIG_BATMAN_ADV_MCAST=n
unused_symbols master linux-2.6.29 CONFIG_BATMAN_ADV_BLA=y CONFIG_BATMAN_ADV_DAT=n CONFIG_BATMAN_ADV_DEBUG=n CONFIG_BATMAN_ADV_NC=n CONFIG_BATMAN_ADV_MCAST=n
unused_symbols master linux-2.6.29 CONFIG_BATMAN_ADV_BLA=y CONFIG_BATMAN_ADV_DAT=y CONFIG_BATMAN_ADV_DEBUG=y CONFIG_BATMAN_ADV_NC=y CONFIG_BATMAN_ADV_MCAST=n
unused_symbols master linux-2.6.30 CONFIG_BATMAN_ADV_BLA=n CONFIG_BATMAN_ADV_DAT=n CONFIG_BATMAN_ADV_DEBUG=y CONFIG_BATMAN_ADV_NC=n CONFIG_BATMAN_ADV_MCAST=n
unused_symbols master linux-2.6.30 CONFIG_BATMAN_ADV_BLA=n CONFIG_BATMAN_ADV_DAT=n CONFIG_BATMAN_ADV_DEBUG=y CONFIG_BATMAN_ADV_NC=y CONFIG_BATMAN_ADV_MCAST=n
unused_symbols master linux-2.6.30 CONFIG_BATMAN_ADV_BLA=y CONFIG_BATMAN_ADV_DAT=n CONFIG_BATMAN_ADV_DEBUG=n CONFIG_BATMAN_ADV_NC=n CONFIG_BATMAN_ADV_MCAST=n
unused_symbols master linux-2.6.30 CONFIG_BATMAN_ADV_BLA=y CONFIG_BATMAN_ADV_DAT=y CONFIG_BATMAN_ADV_DEBUG=y CONFIG_BATMAN_ADV_NC=y CONFIG_BATMAN_ADV_MCAST=n
unused_symbols master linux-2.6.31 CONFIG_BATMAN_ADV_BLA=n CONFIG_BATMAN_ADV_DAT=n CONFIG_BATMAN_ADV_DEBUG=y CONFIG_BATMAN_ADV_NC=n CONFIG_BATMAN_ADV_MCAST=n
unused_symbols master linux-2.6.31 CONFIG_BATMAN_ADV_BLA=n CONFIG_BATMAN_ADV_DAT=n CONFIG_BATMAN_ADV_DEBUG=y CONFIG_BATMAN_ADV_NC=y CONFIG_BATMAN_ADV_MCAST=n
unused_symbols master linux-2.6.31 CONFIG_BATMAN_ADV_BLA=y CONFIG_BATMAN_ADV_DAT=n CONFIG_BATMAN_ADV_DEBUG=n CONFIG_BATMAN_ADV_NC=n CONFIG_BATMAN_ADV_MCAST=n
unused_symbols master linux-2.6.31 CONFIG_BATMAN_ADV_BLA=y CONFIG_BATMAN_ADV_DAT=y CONFIG_BATMAN_ADV_DEBUG=y CONFIG_BATMAN_ADV_NC=y CONFIG_BATMAN_ADV_MCAST=n
unused_symbols master linux-2.6.32 CONFIG_BATMAN_ADV_BLA=n CONFIG_BATMAN_ADV_DAT=n CONFIG_BATMAN_ADV_DEBUG=y CONFIG_BATMAN_ADV_NC=n CONFIG_BATMAN_ADV_MCAST=n
unused_symbols master linux-2.6.32 CONFIG_BATMAN_ADV_BLA=n CONFIG_BATMAN_ADV_DAT=n CONFIG_BATMAN_ADV_DEBUG=y CONFIG_BATMAN_ADV_NC=y CONFIG_BATMAN_ADV_MCAST=n
unused_symbols master linux-2.6.32 CONFIG_BATMAN_ADV_BLA=y CONFIG_BATMAN_ADV_DAT=n CONFIG_BATMAN_ADV_DEBUG=n CONFIG_BATMAN_ADV_NC=n CONFIG_BATMAN_ADV_MCAST=n
unused_symbols master linux-2.6.32 CONFIG_BATMAN_ADV_BLA=y CONFIG_BATMAN_ADV_DAT=y CONFIG_BATMAN_ADV_DEBUG=y CONFIG_BATMAN_ADV_NC=y CONFIG_BATMAN_ADV_MCAST=n
unused_symbols master linux-2.6.34 CONFIG_BATMAN_ADV_BLA=n CONFIG_BATMAN_ADV_DAT=n CONFIG_BATMAN_ADV_DEBUG=y CONFIG_BATMAN_ADV_NC=n CONFIG_BATMAN_ADV_MCAST=n
unused_symbols master linux-2.6.34 CONFIG_BATMAN_ADV_BLA=n CONFIG_BATMAN_ADV_DAT=n CONFIG_BATMAN_ADV_DEBUG=y CONFIG_BATMAN_ADV_NC=y CONFIG_BATMAN_ADV_MCAST=n
unused_symbols master linux-2.6.34 CONFIG_BATMAN_ADV_BLA=y CONFIG_BATMAN_ADV_DAT=n CONFIG_BATMAN_ADV_DEBUG=n CONFIG_BATMAN_ADV_NC=n CONFIG_BATMAN_ADV_MCAST=n
unused_symbols master linux-2.6.34 CONFIG_BATMAN_ADV_BLA=y CONFIG_BATMAN_ADV_DAT=y CONFIG_BATMAN_ADV_DEBUG=y CONFIG_BATMAN_ADV_NC=y CONFIG_BATMAN_ADV_MCAST=n
unused_symbols master linux-2.6.35 CONFIG_BATMAN_ADV_BLA=n CONFIG_BATMAN_ADV_DAT=n CONFIG_BATMAN_ADV_DEBUG=y CONFIG_BATMAN_ADV_NC=n CONFIG_BATMAN_ADV_MCAST=n
unused_symbols master linux-2.6.35 CONFIG_BATMAN_ADV_BLA=n CONFIG_BATMAN_ADV_DAT=n CONFIG_BATMAN_ADV_DEBUG=y CONFIG_BATMAN_ADV_NC=y CONFIG_BATMAN_ADV_MCAST=n
unused_symbols master linux-2.6.35 CONFIG_BATMAN_ADV_BLA=y CONFIG_BATMAN_ADV_DAT=n CONFIG_BATMAN_ADV_DEBUG=n CONFIG_BATMAN_ADV_NC=n CONFIG_BATMAN_ADV_MCAST=n
unused_symbols master linux-2.6.35 CONFIG_BATMAN_ADV_BLA=y CONFIG_BATMAN_ADV_DAT=y CONFIG_BATMAN_ADV_DEBUG=y CONFIG_BATMAN_ADV_NC=y CONFIG_BATMAN_ADV_MCAST=n
unused_symbols master linux-2.6.36 CONFIG_BATMAN_ADV_BLA=n CONFIG_BATMAN_ADV_DAT=n CONFIG_BATMAN_ADV_DEBUG=y CONFIG_BATMAN_ADV_NC=n CONFIG_BATMAN_ADV_MCAST=n
unused_symbols master linux-2.6.36 CONFIG_BATMAN_ADV_BLA=n CONFIG_BATMAN_ADV_DAT=n CONFIG_BATMAN_ADV_DEBUG=y CONFIG_BATMAN_ADV_NC=y CONFIG_BATMAN_ADV_MCAST=n
unused_symbols master linux-2.6.36 CONFIG_BATMAN_ADV_BLA=y CONFIG_BATMAN_ADV_DAT=n CONFIG_BATMAN_ADV_DEBUG=n CONFIG_BATMAN_ADV_NC=n CONFIG_BATMAN_ADV_MCAST=n
unused_symbols master linux-2.6.36 CONFIG_BATMAN_ADV_BLA=y CONFIG_BATMAN_ADV_DAT=y CONFIG_BATMAN_ADV_DEBUG=y CONFIG_BATMAN_ADV_NC=y CONFIG_BATMAN_ADV_MCAST=n
unused_symbols master linux-2.6.37 CONFIG_BATMAN_ADV_BLA=n CONFIG_BATMAN_ADV_DAT=n CONFIG_BATMAN_ADV_DEBUG=y CONFIG_BATMAN_ADV_NC=n CONFIG_BATMAN_ADV_MCAST=n
unused_symbols master linux-2.6.37 CONFIG_BATMAN_ADV_BLA=n CONFIG_BATMAN_ADV_DAT=n CONFIG_BATMAN_ADV_DEBUG=y CONFIG_BATMAN_ADV_NC=y CONFIG_BATMAN_ADV_MCAST=n
unused_symbols master linux-2.6.37 CONFIG_BATMAN_ADV_BLA=y CONFIG_BATMAN_ADV_DAT=n CONFIG_BATMAN_ADV_DEBUG=n CONFIG_BATMAN_ADV_NC=n CONFIG_BATMAN_ADV_MCAST=n
unused_symbols master linux-2.6.37 CONFIG_BATMAN_ADV_BLA=y CONFIG_BATMAN_ADV_DAT=y CONFIG_BATMAN_ADV_DEBUG=y CONFIG_BATMAN_ADV_NC=y CONFIG_BATMAN_ADV_MCAST=n
unused_symbols master linux-2.6.38 CONFIG_BATMAN_ADV_BLA=n CONFIG_BATMAN_ADV_DAT=n CONFIG_BATMAN_ADV_DEBUG=y CONFIG_BATMAN_ADV_NC=n CONFIG_BATMAN_ADV_MCAST=n
unused_symbols master linux-2.6.38 CONFIG_BATMAN_ADV_BLA=n CONFIG_BATMAN_ADV_DAT=n CONFIG_BATMAN_ADV_DEBUG=y CONFIG_BATMAN_ADV_NC=y CONFIG_BATMAN_ADV_MCAST=n
unused_symbols master linux-2.6.38 CONFIG_BATMAN_ADV_BLA=y CONFIG_BATMAN_ADV_DAT=n CONFIG_BATMAN_ADV_DEBUG=n CONFIG_BATMAN_ADV_NC=n CONFIG_BATMAN_ADV_MCAST=n
unused_symbols master linux-2.6.38 CONFIG_BATMAN_ADV_BLA=y CONFIG_BATMAN_ADV_DAT=y CONFIG_BATMAN_ADV_DEBUG=y CONFIG_BATMAN_ADV_NC=y CONFIG_BATMAN_ADV_MCAST=n
unused_symbols master linux-2.6.39 CONFIG_BATMAN_ADV_BLA=n CONFIG_BATMAN_ADV_DAT=n CONFIG_BATMAN_ADV_DEBUG=y CONFIG_BATMAN_ADV_NC=n CONFIG_BATMAN_ADV_MCAST=n
unused_symbols master linux-2.6.39 CONFIG_BATMAN_ADV_BLA=n CONFIG_BATMAN_ADV_DAT=n CONFIG_BATMAN_ADV_DEBUG=y CONFIG_BATMAN_ADV_NC=y CONFIG_BATMAN_ADV_MCAST=n
unused_symbols master linux-2.6.39 CONFIG_BATMAN_ADV_BLA=y CONFIG_BATMAN_ADV_DAT=n CONFIG_BATMAN_ADV_DEBUG=n CONFIG_BATMAN_ADV_NC=n CONFIG_BATMAN_ADV_MCAST=n
unused_symbols master linux-2.6.39 CONFIG_BATMAN_ADV_BLA=y CONFIG_BATMAN_ADV_DAT=y CONFIG_BATMAN_ADV_DEBUG=y CONFIG_BATMAN_ADV_NC=y CONFIG_BATMAN_ADV_MCAST=n
unused_symbols master linux-3.0 CONFIG_BATMAN_ADV_BLA=n CONFIG_BATMAN_ADV_DAT=n CONFIG_BATMAN_ADV_DEBUG=y CONFIG_BATMAN_ADV_NC=n CONFIG_BATMAN_ADV_MCAST=n
unused_symbols master linux-3.0 CONFIG_BATMAN_ADV_BLA=n CONFIG_BATMAN_ADV_DAT=n CONFIG_BATMAN_ADV_DEBUG=y CONFIG_BATMAN_ADV_NC=y CONFIG_BATMAN_ADV_MCAST=n
unused_symbols master linux-3.0 CONFIG_BATMAN_ADV_BLA=y CONFIG_BATMAN_ADV_DAT=n CONFIG_BATMAN_ADV_DEBUG=n CONFIG_BATMAN_ADV_NC=n CONFIG_BATMAN_ADV_MCAST=n
unused_symbols master linux-3.0 CONFIG_BATMAN_ADV_BLA=y CONFIG_BATMAN_ADV_DAT=y CONFIG_BATMAN_ADV_DEBUG=y CONFIG_BATMAN_ADV_NC=y CONFIG_BATMAN_ADV_MCAST=n

Output of different failed tests
================================

bracket_align master debugfs.h:
>>>>>>>>
Found wrong alignment at debugfs.h:52, was 17 but expected 45
Found wrong alignment at debugfs.h:58, was 17 but expected 46

checkpatch next main.c:
>>>>>>>>
CHECK: No space is necessary after a cast
#440: FILE: main.c:440:
+	BUILD_BUG_ON(sizeof(struct batadv_bla_claim_dst) != 6);

CHECK: No space is necessary after a cast
#441: FILE: main.c:441:
+	BUILD_BUG_ON(sizeof(struct batadv_ogm_packet) != 24);

CHECK: No space is necessary after a cast
#442: FILE: main.c:442:
+	BUILD_BUG_ON(sizeof(struct batadv_icmp_header) != 20);

CHECK: No space is necessary after a cast
#443: FILE: main.c:443:
+	BUILD_BUG_ON(sizeof(struct batadv_icmp_packet) != 20);

CHECK: No space is necessary after a cast
#444: FILE: main.c:444:
+	BUILD_BUG_ON(sizeof(struct batadv_icmp_packet_rr) != 116);

CHECK: No space is necessary after a cast
#445: FILE: main.c:445:
+	BUILD_BUG_ON(sizeof(struct batadv_unicast_packet) != 10);

CHECK: No space is necessary after a cast
#446: FILE: main.c:446:
+	BUILD_BUG_ON(sizeof(struct batadv_unicast_4addr_packet) != 18);

CHECK: No space is necessary after a cast
#447: FILE: main.c:447:
+	BUILD_BUG_ON(sizeof(struct batadv_frag_packet) != 20);

CHECK: No space is necessary after a cast
#448: FILE: main.c:448:
+	BUILD_BUG_ON(sizeof(struct batadv_bcast_packet) != 14);

CHECK: No space is necessary after a cast
#449: FILE: main.c:449:
+	BUILD_BUG_ON(sizeof(struct batadv_coded_packet) != 46);

CHECK: No space is necessary after a cast
#450: FILE: main.c:450:
+	BUILD_BUG_ON(sizeof(struct batadv_unicast_tvlv_packet) != 20);

CHECK: No space is necessary after a cast
#451: FILE: main.c:451:
+	BUILD_BUG_ON(sizeof(struct batadv_tvlv_hdr) != 4);

CHECK: No space is necessary after a cast
#452: FILE: main.c:452:
+	BUILD_BUG_ON(sizeof(struct batadv_tvlv_gateway_data) != 8);

CHECK: No space is necessary after a cast
#453: FILE: main.c:453:
+	BUILD_BUG_ON(sizeof(struct batadv_tvlv_tt_vlan_data) != 8);

CHECK: No space is necessary after a cast
#454: FILE: main.c:454:
+	BUILD_BUG_ON(sizeof(struct batadv_tvlv_tt_change) != 12);

CHECK: No space is necessary after a cast
#455: FILE: main.c:455:
+	BUILD_BUG_ON(sizeof(struct batadv_tvlv_roam_adv) != 8);

total: 0 errors, 0 warnings, 16 checks, 1265 lines checked

checkpatch next main.h:
>>>>>>>>
CHECK: spaces preferred around that '*' (ctx:VxV)
#47: FILE: main.h:47:
+#define BATADV_DAT_ENTRY_TIMEOUT (5*60000) /* 5 mins in milliseconds */
                                    ^

total: 0 errors, 0 warnings, 1 checks, 390 lines checked

checkpatch next network-coding.c:
>>>>>>>>
CHECK: spaces preferred around that '*' (ctx:VxV)
#278: FILE: network-coding.c:278:
+				    bat_priv->nc.max_buffer_time*10);
 				                                ^

total: 0 errors, 0 warnings, 1 checks, 1936 lines checked

checkpatch next soft-interface.c:
>>>>>>>>
CHECK: Comparison to NULL could be written "hard_iface->soft_iface"
#827: FILE: soft-interface.c:827:
+	if (!hard_iface || hard_iface->soft_iface != NULL)

total: 0 errors, 0 warnings, 1 checks, 1113 lines checked

sparse master linux-3.0 CONFIG_BATMAN_ADV_BLA=n CONFIG_BATMAN_ADV_DAT=n CONFIG_BATMAN_ADV_DEBUG=y CONFIG_BATMAN_ADV_NC=n CONFIG_BATMAN_ADV_MCAST=n:
>>>>>>>>
/home/batman/build_test/tmp/debugfs.h:23:15: error: not a function <noident>
/home/batman/build_test/tmp/debugfs.h:23:15: error: bad constant expression type
In file included from /home/batman/build_test/tmp/debugfs.c:22:0:
/home/batman/build_test/tmp/debugfs.h:23:15: error: missing binary operator before token "("
/home/batman/build_test/tmp/debugfs.c:416:6: error: redefinition of 'batadv_debugfs_init'
In file included from /home/batman/build_test/tmp/debugfs.c:22:0:
/home/batman/build_test/tmp/debugfs.h:34:20: note: previous definition of 'batadv_debugfs_init' was here
/home/batman/build_test/tmp/debugfs.c:446:6: error: redefinition of 'batadv_debugfs_destroy'
In file included from /home/batman/build_test/tmp/debugfs.c:22:0:
/home/batman/build_test/tmp/debugfs.h:38:20: note: previous definition of 'batadv_debugfs_destroy' was here
/home/batman/build_test/tmp/debugfs.c:457:5: error: redefinition of 'batadv_debugfs_add_hardif'
In file included from /home/batman/build_test/tmp/debugfs.c:22:0:
/home/batman/build_test/tmp/debugfs.h:51:19: note: previous definition of 'batadv_debugfs_add_hardif' was here
/home/batman/build_test/tmp/debugfs.c:493:6: error: redefinition of 'batadv_debugfs_del_hardif'
In file included from /home/batman/build_test/tmp/debugfs.c:22:0:
/home/batman/build_test/tmp/debugfs.h:57:20: note: previous definition of 'batadv_debugfs_del_hardif' was here
/home/batman/build_test/tmp/debugfs.c:501:5: error: redefinition of 'batadv_debugfs_add_meshif'
In file included from /home/batman/build_test/tmp/debugfs.c:22:0:
/home/batman/build_test/tmp/debugfs.h:42:19: note: previous definition of 'batadv_debugfs_add_meshif' was here
/home/batman/build_test/tmp/debugfs.c:543:6: error: redefinition of 'batadv_debugfs_del_meshif'
In file included from /home/batman/build_test/tmp/debugfs.c:22:0:
/home/batman/build_test/tmp/debugfs.h:47:20: note: previous definition of 'batadv_debugfs_del_meshif' was here
make[2]: *** [/home/batman/build_test/tmp/debugfs.o] Error 1
make[1]: *** [_module_/home/batman/build_test/tmp] Error 2
make: *** [all] Error 2

sparse master linux-3.15 CONFIG_BATMAN_ADV_BLA=n CONFIG_BATMAN_ADV_DAT=n CONFIG_BATMAN_ADV_DEBUG=y CONFIG_BATMAN_ADV_NC=y CONFIG_BATMAN_ADV_MCAST=n:
>>>>>>>>
include/linux/rculist.h:402:9: warning: Variable length array is used.
include/linux/rculist.h:402:9: error: cannot size expression
/home/batman/build_test/tmp/gateway_client.c:106:9: warning: Variable length array is used.
/home/batman/build_test/tmp/gateway_client.c:106:9: error: cannot size expression
include/linux/rculist.h:402:9: error: cannot size expression
/home/batman/build_test/tmp/hard-interface.c:194:9: warning: Variable length array is used.
/home/batman/build_test/tmp/hard-interface.c:194:9: error: cannot size expression
include/linux/rculist.h:54:9: error: cannot size expression
include/linux/rculist.h:402:9: warning: Variable length array is used.
include/linux/rculist.h:402:9: error: cannot size expression
include/linux/rculist.h:54:9: warning: Variable length array is used.
include/linux/rculist.h:54:9: error: cannot size expression
include/linux/rculist.h:402:9: error: cannot size expression
include/linux/rculist.h:54:9: warning: Variable length array is used.
include/linux/rculist.h:54:9: error: cannot size expression
include/linux/rculist.h:402:9: error: cannot size expression
/home/batman/build_test/tmp/routing.c:91:9: warning: Variable length array is used.
/home/batman/build_test/tmp/routing.c:91:9: error: cannot size expression
include/linux/rculist.h:402:9: warning: Variable length array is used.
include/linux/rculist.h:402:9: error: cannot size expression
include/linux/rculist.h:402:9: warning: Variable length array is used.
include/linux/rculist.h:402:9: error: cannot size expression

sparse master linux-3.15 CONFIG_BATMAN_ADV_BLA=y CONFIG_BATMAN_ADV_DAT=y CONFIG_BATMAN_ADV_DEBUG=y CONFIG_BATMAN_ADV_NC=y CONFIG_BATMAN_ADV_MCAST=n:
>>>>>>>>
include/linux/rculist.h:402:9: warning: Variable length array is used.
include/linux/rculist.h:402:9: error: cannot size expression
include/linux/rculist.h:402:9: warning: Variable length array is used.
include/linux/rculist.h:402:9: error: cannot size expression
include/linux/rculist.h:402:9: warning: Variable length array is used.
include/linux/rculist.h:402:9: error: cannot size expression
/home/batman/build_test/tmp/gateway_client.c:106:9: warning: Variable length array is used.
/home/batman/build_test/tmp/gateway_client.c:106:9: error: cannot size expression
include/linux/rculist.h:402:9: error: cannot size expression
/home/batman/build_test/tmp/hard-interface.c:194:9: warning: Variable length array is used.
/home/batman/build_test/tmp/hard-interface.c:194:9: error: cannot size expression
include/linux/rculist.h:54:9: error: cannot size expression
include/linux/rculist.h:402:9: warning: Variable length array is used.
include/linux/rculist.h:402:9: error: cannot size expression
include/linux/rculist.h:54:9: warning: Variable length array is used.
include/linux/rculist.h:54:9: error: cannot size expression
include/linux/rculist.h:402:9: error: cannot size expression
include/linux/rculist.h:54:9: warning: Variable length array is used.
include/linux/rculist.h:54:9: error: cannot size expression
include/linux/rculist.h:402:9: error: cannot size expression
/home/batman/build_test/tmp/routing.c:91:9: warning: Variable length array is used.
/home/batman/build_test/tmp/routing.c:91:9: error: cannot size expression
include/linux/rculist.h:402:9: warning: Variable length array is used.
include/linux/rculist.h:402:9: error: cannot size expression
include/linux/rculist.h:402:9: warning: Variable length array is used.
include/linux/rculist.h:402:9: error: cannot size expression

sparse next linux-3.15 CONFIG_BATMAN_ADV_BLA=n CONFIG_BATMAN_ADV_DAT=n CONFIG_BATMAN_ADV_DEBUG=n CONFIG_BATMAN_ADV_NC=n CONFIG_BATMAN_ADV_MCAST=n:
>>>>>>>>
include/linux/rculist.h:402:9: warning: Variable length array is used.
include/linux/rculist.h:402:9: error: cannot size expression
/home/batman/build_test/tmp/gateway_client.c:106:9: warning: Variable length array is used.
/home/batman/build_test/tmp/gateway_client.c:106:9: error: cannot size expression
include/linux/rculist.h:402:9: error: cannot size expression
/home/batman/build_test/tmp/hard-interface.c:194:9: warning: Variable length array is used.
/home/batman/build_test/tmp/hard-interface.c:194:9: error: cannot size expression
include/linux/rculist.h:54:9: error: cannot size expression
include/linux/rculist.h:402:9: warning: Variable length array is used.
include/linux/rculist.h:402:9: error: cannot size expression
include/linux/rculist.h:54:9: warning: Variable length array is used.
include/linux/rculist.h:54:9: error: cannot size expression
include/linux/rculist.h:402:9: error: cannot size expression
/home/batman/build_test/tmp/routing.c:91:9: warning: Variable length array is used.
/home/batman/build_test/tmp/routing.c:91:9: error: cannot size expression
include/linux/rculist.h:402:9: warning: Variable length array is used.
include/linux/rculist.h:402:9: error: cannot size expression
include/linux/rculist.h:402:9: warning: Variable length array is used.
include/linux/rculist.h:402:9: error: cannot size expression

sparse next linux-3.15 CONFIG_BATMAN_ADV_BLA=n CONFIG_BATMAN_ADV_DAT=y CONFIG_BATMAN_ADV_DEBUG=n CONFIG_BATMAN_ADV_NC=n CONFIG_BATMAN_ADV_MCAST=n:
>>>>>>>>
include/linux/rculist.h:402:9: warning: Variable length array is used.
include/linux/rculist.h:402:9: error: cannot size expression
include/linux/rculist.h:402:9: warning: Variable length array is used.
include/linux/rculist.h:402:9: error: cannot size expression
/home/batman/build_test/tmp/gateway_client.c:106:9: warning: Variable length array is used.
/home/batman/build_test/tmp/gateway_client.c:106:9: error: cannot size expression
include/linux/rculist.h:402:9: error: cannot size expression
/home/batman/build_test/tmp/hard-interface.c:194:9: warning: Variable length array is used.
/home/batman/build_test/tmp/hard-interface.c:194:9: error: cannot size expression
include/linux/rculist.h:54:9: error: cannot size expression
include/linux/rculist.h:402:9: warning: Variable length array is used.
include/linux/rculist.h:402:9: error: cannot size expression
include/linux/rculist.h:54:9: warning: Variable length array is used.
include/linux/rculist.h:54:9: error: cannot size expression
include/linux/rculist.h:402:9: error: cannot size expression
/home/batman/build_test/tmp/routing.c:91:9: warning: Variable length array is used.
/home/batman/build_test/tmp/routing.c:91:9: error: cannot size expression
include/linux/rculist.h:402:9: warning: Variable length array is used.
include/linux/rculist.h:402:9: error: cannot size expression
include/linux/rculist.h:402:9: warning: Variable length array is used.
include/linux/rculist.h:402:9: error: cannot size expression

sparse next linux-3.15 CONFIG_BATMAN_ADV_BLA=n CONFIG_BATMAN_ADV_DAT=y CONFIG_BATMAN_ADV_DEBUG=n CONFIG_BATMAN_ADV_NC=y CONFIG_BATMAN_ADV_MCAST=y:
>>>>>>>>
include/linux/rculist.h:402:9: warning: Variable length array is used.
include/linux/rculist.h:402:9: error: cannot size expression
include/linux/rculist.h:402:9: warning: Variable length array is used.
include/linux/rculist.h:402:9: error: cannot size expression
/home/batman/build_test/tmp/gateway_client.c:106:9: warning: Variable length array is used.
/home/batman/build_test/tmp/gateway_client.c:106:9: error: cannot size expression
include/linux/rculist.h:402:9: error: cannot size expression
/home/batman/build_test/tmp/hard-interface.c:194:9: warning: Variable length array is used.
/home/batman/build_test/tmp/hard-interface.c:194:9: error: cannot size expression
include/linux/rculist.h:54:9: error: cannot size expression
include/linux/rculist.h:402:9: warning: Variable length array is used.
include/linux/rculist.h:402:9: error: cannot size expression
include/linux/rculist.h:54:9: warning: Variable length array is used.
include/linux/rculist.h:54:9: error: cannot size expression
include/linux/rculist.h:402:9: error: cannot size expression
include/linux/rculist.h:54:9: warning: Variable length array is used.
include/linux/rculist.h:54:9: error: cannot size expression
include/linux/rculist.h:402:9: error: cannot size expression
/home/batman/build_test/tmp/routing.c:91:9: warning: Variable length array is used.
/home/batman/build_test/tmp/routing.c:91:9: error: cannot size expression
include/linux/rculist.h:402:9: warning: Variable length array is used.
include/linux/rculist.h:402:9: error: cannot size expression
include/linux/rculist.h:402:9: warning: Variable length array is used.
include/linux/rculist.h:402:9: error: cannot size expression
include/linux/rculist.h:402:9: warning: Variable length array is used.
include/linux/rculist.h:402:9: error: cannot size expression

sparse next linux-3.15 CONFIG_BATMAN_ADV_BLA=y CONFIG_BATMAN_ADV_DAT=y CONFIG_BATMAN_ADV_DEBUG=y CONFIG_BATMAN_ADV_NC=n CONFIG_BATMAN_ADV_MCAST=y:
>>>>>>>>
include/linux/rculist.h:402:9: warning: Variable length array is used.
include/linux/rculist.h:402:9: error: cannot size expression
include/linux/rculist.h:402:9: warning: Variable length array is used.
include/linux/rculist.h:402:9: error: cannot size expression
include/linux/rculist.h:402:9: warning: Variable length array is used.
include/linux/rculist.h:402:9: error: cannot size expression
/home/batman/build_test/tmp/gateway_client.c:106:9: warning: Variable length array is used.
/home/batman/build_test/tmp/gateway_client.c:106:9: error: cannot size expression
include/linux/rculist.h:402:9: error: cannot size expression
/home/batman/build_test/tmp/hard-interface.c:194:9: warning: Variable length array is used.
/home/batman/build_test/tmp/hard-interface.c:194:9: error: cannot size expression
include/linux/rculist.h:54:9: error: cannot size expression
include/linux/rculist.h:402:9: warning: Variable length array is used.
include/linux/rculist.h:402:9: error: cannot size expression
include/linux/rculist.h:54:9: warning: Variable length array is used.
include/linux/rculist.h:54:9: error: cannot size expression
include/linux/rculist.h:402:9: error: cannot size expression
/home/batman/build_test/tmp/routing.c:91:9: warning: Variable length array is used.
/home/batman/build_test/tmp/routing.c:91:9: error: cannot size expression
include/linux/rculist.h:402:9: warning: Variable length array is used.
include/linux/rculist.h:402:9: error: cannot size expression
include/linux/rculist.h:402:9: warning: Variable length array is used.
include/linux/rculist.h:402:9: error: cannot size expression
include/linux/rculist.h:402:9: warning: Variable length array is used.
include/linux/rculist.h:402:9: error: cannot size expression

unused_symbols master linux-2.6.39 CONFIG_BATMAN_ADV_BLA=n CONFIG_BATMAN_ADV_DAT=n CONFIG_BATMAN_ADV_DEBUG=y CONFIG_BATMAN_ADV_NC=n CONFIG_BATMAN_ADV_MCAST=n:
>>>>>>>>
batadv_free_rcu_gw_node
batadv_free_rcu_orig_vlan
batadv_free_rcu_softif_vlan
batadv_free_rcu_tt_global_entry
batadv_free_rcu_tt_local_entry
batadv_free_rcu_tvlv_handler
batadv_iv_init

unused_symbols master linux-2.6.39 CONFIG_BATMAN_ADV_BLA=n CONFIG_BATMAN_ADV_DAT=n CONFIG_BATMAN_ADV_DEBUG=y CONFIG_BATMAN_ADV_NC=y CONFIG_BATMAN_ADV_MCAST=n:
>>>>>>>>
batadv_free_rcu_gw_node
batadv_free_rcu_nc_path
batadv_free_rcu_orig_vlan
batadv_free_rcu_softif_vlan
batadv_free_rcu_tt_global_entry
batadv_free_rcu_tt_local_entry
batadv_free_rcu_tvlv_handler
batadv_iv_init

unused_symbols master linux-2.6.39 CONFIG_BATMAN_ADV_BLA=y CONFIG_BATMAN_ADV_DAT=n CONFIG_BATMAN_ADV_DEBUG=n CONFIG_BATMAN_ADV_NC=n CONFIG_BATMAN_ADV_MCAST=n:
>>>>>>>>
batadv_bla_backbone_table_seq_print_text
batadv_bla_check_bcast_duplist
batadv_bla_claim_table_seq_print_text
batadv_bla_free
batadv_bla_init
batadv_bla_is_backbone_gw
batadv_bla_is_backbone_gw_orig
batadv_bla_rx
batadv_bla_tx
batadv_bla_update_orig_address
batadv_free_rcu_gw_node
batadv_free_rcu_orig_vlan
batadv_free_rcu_softif_vlan
batadv_free_rcu_tt_global_entry
batadv_free_rcu_tt_local_entry
batadv_free_rcu_tvlv_handler
batadv_iv_init

unused_symbols master linux-2.6.39 CONFIG_BATMAN_ADV_BLA=y CONFIG_BATMAN_ADV_DAT=y CONFIG_BATMAN_ADV_DEBUG=y CONFIG_BATMAN_ADV_NC=y CONFIG_BATMAN_ADV_MCAST=n:
>>>>>>>>
batadv_bla_backbone_table_seq_print_text
batadv_bla_check_bcast_duplist
batadv_bla_claim_table_seq_print_text
batadv_bla_free
batadv_bla_init
batadv_bla_is_backbone_gw
batadv_bla_is_backbone_gw_orig
batadv_bla_rx
batadv_bla_tx
batadv_bla_update_orig_address
batadv_free_rcu_dat_entry
batadv_free_rcu_gw_node
batadv_free_rcu_nc_path
batadv_free_rcu_orig_vlan
batadv_free_rcu_softif_vlan
batadv_free_rcu_tt_global_entry
batadv_free_rcu_tt_local_entry
batadv_free_rcu_tvlv_handler
batadv_iv_init

unused_symbols master linux-3.0 CONFIG_BATMAN_ADV_BLA=n CONFIG_BATMAN_ADV_DAT=n CONFIG_BATMAN_ADV_DEBUG=y CONFIG_BATMAN_ADV_NC=n CONFIG_BATMAN_ADV_MCAST=n:
>>>>>>>>
batadv_iv_init

unused_symbols master linux-3.0 CONFIG_BATMAN_ADV_BLA=y CONFIG_BATMAN_ADV_DAT=y CONFIG_BATMAN_ADV_DEBUG=y CONFIG_BATMAN_ADV_NC=y CONFIG_BATMAN_ADV_MCAST=n:
>>>>>>>>
batadv_bla_backbone_table_seq_print_text
batadv_bla_check_bcast_duplist
batadv_bla_claim_table_seq_print_text
batadv_bla_free
batadv_bla_init
batadv_bla_is_backbone_gw
batadv_bla_is_backbone_gw_orig
batadv_bla_rx
batadv_bla_tx
batadv_bla_update_orig_address
batadv_iv_init



More information about the linux-merge mailing list