Build check errors found: 2014-11-24

postmaster at open-mesh.org postmaster at open-mesh.org
Mon Nov 24 01:40:19 CET 2014


Name of failed tests
====================

checkpatch master bridge_loop_avoidance.c
checkpatch master debugfs.c
checkpatch master main.c
checkpatch master packet.h
checkpatch master routing.c
checkpatch master soft-interface.c
checkpatch master translation-table.c
checkpatch master types.h
checkpatch next bat_iv_ogm.c
checkpatch next bitarray.c
checkpatch next bridge_loop_avoidance.c
checkpatch next debugfs.c
checkpatch next distributed-arp-table.c
checkpatch next fragmentation.c
checkpatch next gateway_client.c
checkpatch next main.c
checkpatch next multicast.h
checkpatch next originator.c
checkpatch next originator.h
checkpatch next packet.h
checkpatch next routing.c
checkpatch next soft-interface.c
checkpatch next sysfs.c
checkpatch next translation-table.c
checkpatch next types.h
sparse master linux-3.15 CONFIG_BATMAN_ADV_BLA=n CONFIG_BATMAN_ADV_DAT=y CONFIG_BATMAN_ADV_DEBUG=n CONFIG_BATMAN_ADV_NC=n CONFIG_BATMAN_ADV_MCAST=n
sparse master linux-3.15 CONFIG_BATMAN_ADV_BLA=n CONFIG_BATMAN_ADV_DAT=y CONFIG_BATMAN_ADV_DEBUG=y CONFIG_BATMAN_ADV_NC=n CONFIG_BATMAN_ADV_MCAST=n
sparse master linux-3.15 CONFIG_BATMAN_ADV_BLA=y CONFIG_BATMAN_ADV_DAT=n CONFIG_BATMAN_ADV_DEBUG=y CONFIG_BATMAN_ADV_NC=n CONFIG_BATMAN_ADV_MCAST=y
sparse master linux-3.15 CONFIG_BATMAN_ADV_BLA=y CONFIG_BATMAN_ADV_DAT=n CONFIG_BATMAN_ADV_DEBUG=y CONFIG_BATMAN_ADV_NC=y CONFIG_BATMAN_ADV_MCAST=y
sparse next linux-3.15 CONFIG_BATMAN_ADV_BLA=n CONFIG_BATMAN_ADV_DAT=n CONFIG_BATMAN_ADV_DEBUG=n CONFIG_BATMAN_ADV_NC=n CONFIG_BATMAN_ADV_MCAST=n
sparse next linux-3.15 CONFIG_BATMAN_ADV_BLA=n CONFIG_BATMAN_ADV_DAT=n CONFIG_BATMAN_ADV_DEBUG=n CONFIG_BATMAN_ADV_NC=y CONFIG_BATMAN_ADV_MCAST=y
sparse next linux-3.15 CONFIG_BATMAN_ADV_BLA=y CONFIG_BATMAN_ADV_DAT=n CONFIG_BATMAN_ADV_DEBUG=y CONFIG_BATMAN_ADV_NC=y CONFIG_BATMAN_ADV_MCAST=n
sparse next linux-3.15 CONFIG_BATMAN_ADV_BLA=y CONFIG_BATMAN_ADV_DAT=y CONFIG_BATMAN_ADV_DEBUG=n CONFIG_BATMAN_ADV_NC=n CONFIG_BATMAN_ADV_MCAST=y

Output of different failed tests
================================

checkpatch master bridge_loop_avoidance.c:
>>>>>>>>
CHECK: 'intialize' may be misspelled - perhaps 'initialize'?
#247: FILE: bridge_loop_avoidance.c:247:
+	/* all claims gone, intialize CRC */

CHECK: 'occurence' may be misspelled - perhaps 'occurrence'?
#1331: FILE: bridge_loop_avoidance.c:1331:
+	 * and allow it, its the first occurence.

total: 0 errors, 0 warnings, 2 checks, 1722 lines checked

checkpatch master debugfs.c:
>>>>>>>>
WARNING: void function return statements are not generally useful
#237: FILE: debugfs.c:237:
+	return;
+}

total: 0 errors, 1 warnings, 0 checks, 562 lines checked

checkpatch master main.c:
>>>>>>>>
CHECK: No space is necessary after a cast
#440: FILE: main.c:440:
+	BUILD_BUG_ON(sizeof(struct batadv_bla_claim_dst) != 6);

CHECK: No space is necessary after a cast
#441: FILE: main.c:441:
+	BUILD_BUG_ON(sizeof(struct batadv_ogm_packet) != 24);

CHECK: No space is necessary after a cast
#442: FILE: main.c:442:
+	BUILD_BUG_ON(sizeof(struct batadv_icmp_header) != 20);

CHECK: No space is necessary after a cast
#443: FILE: main.c:443:
+	BUILD_BUG_ON(sizeof(struct batadv_icmp_packet) != 20);

CHECK: No space is necessary after a cast
#444: FILE: main.c:444:
+	BUILD_BUG_ON(sizeof(struct batadv_icmp_packet_rr) != 116);

CHECK: No space is necessary after a cast
#445: FILE: main.c:445:
+	BUILD_BUG_ON(sizeof(struct batadv_unicast_packet) != 10);

CHECK: No space is necessary after a cast
#446: FILE: main.c:446:
+	BUILD_BUG_ON(sizeof(struct batadv_unicast_4addr_packet) != 18);

CHECK: No space is necessary after a cast
#447: FILE: main.c:447:
+	BUILD_BUG_ON(sizeof(struct batadv_frag_packet) != 20);

CHECK: No space is necessary after a cast
#448: FILE: main.c:448:
+	BUILD_BUG_ON(sizeof(struct batadv_bcast_packet) != 14);

CHECK: No space is necessary after a cast
#449: FILE: main.c:449:
+	BUILD_BUG_ON(sizeof(struct batadv_coded_packet) != 46);

CHECK: No space is necessary after a cast
#450: FILE: main.c:450:
+	BUILD_BUG_ON(sizeof(struct batadv_unicast_tvlv_packet) != 20);

CHECK: No space is necessary after a cast
#451: FILE: main.c:451:
+	BUILD_BUG_ON(sizeof(struct batadv_tvlv_hdr) != 4);

CHECK: No space is necessary after a cast
#452: FILE: main.c:452:
+	BUILD_BUG_ON(sizeof(struct batadv_tvlv_gateway_data) != 8);

CHECK: No space is necessary after a cast
#453: FILE: main.c:453:
+	BUILD_BUG_ON(sizeof(struct batadv_tvlv_tt_vlan_data) != 8);

CHECK: No space is necessary after a cast
#454: FILE: main.c:454:
+	BUILD_BUG_ON(sizeof(struct batadv_tvlv_tt_change) != 12);

CHECK: No space is necessary after a cast
#455: FILE: main.c:455:
+	BUILD_BUG_ON(sizeof(struct batadv_tvlv_roam_adv) != 8);

CHECK: 'accomodate' may be misspelled - perhaps 'accommodate'?
#801: FILE: main.c:801:
+ * batadv_tvlv_realloc_packet_buff - reallocate packet buffer to accomodate

total: 0 errors, 0 warnings, 17 checks, 1265 lines checked

checkpatch master packet.h:
>>>>>>>>
CHECK: 'endianess' may be misspelled - perhaps 'endianness'?
#380: FILE: packet.h:380:
+#error "unknown bitfield endianess"

CHECK: 'boundry' may be misspelled - perhaps 'boundary'?
#456: FILE: packet.h:456:
+ * @align: 2 bytes to align the header to a 4 byte boundry

total: 0 errors, 0 warnings, 2 checks, 553 lines checked

checkpatch master routing.c:
>>>>>>>>
CHECK: 'choosen' may be misspelled - perhaps 'chosen'?
#459: FILE: routing.c:459:
+	 * If this can't be found either, return the previously choosen

total: 0 errors, 0 warnings, 1 checks, 1086 lines checked

checkpatch master soft-interface.c:
>>>>>>>>
CHECK: Comparison to NULL could be written "hard_iface->soft_iface"
#827: FILE: soft-interface.c:827:
+	if (!hard_iface || hard_iface->soft_iface != NULL)

total: 0 errors, 0 warnings, 1 checks, 1113 lines checked

checkpatch master translation-table.c:
>>>>>>>>
CHECK: 'adress' may be misspelled - perhaps 'address'?
#2855: FILE: translation-table.c:2855:
+ * @addr: the mac adress of the client to check

total: 0 errors, 0 warnings, 1 checks, 3710 lines checked

checkpatch master types.h:
>>>>>>>>
CHECK: 'occured' may be misspelled - perhaps 'occurred'?
#971: FILE: types.h:971:
+ * struct batadv_tt_change_node - structure for tt changes occured

total: 0 errors, 0 warnings, 1 checks, 1257 lines checked

checkpatch next bat_iv_ogm.c:
>>>>>>>>
CHECK: Please don't use multiple blank lines
#29: FILE: bat_iv_ogm.c:29:
+
+

CHECK: Unnecessary parentheses around orig_node->bat_iv.bcast_own[word_index]
#882: FILE: bat_iv_ogm.c:882:
+			word = &(orig_node->bat_iv.bcast_own[word_index]);

CHECK: Please don't use multiple blank lines
#1365: FILE: bat_iv_ogm.c:1365:
+
+

CHECK: Unnecessary parentheses around orig_neigh_node->bat_iv.bcast_own[offset]
#1667: FILE: bat_iv_ogm.c:1667:
+			word = &(orig_neigh_node->bat_iv.bcast_own[offset]);

total: 0 errors, 0 warnings, 4 checks, 1980 lines checked

checkpatch next bitarray.c:
>>>>>>>>
CHECK: Please don't use multiple blank lines
#32: FILE: bitarray.c:32:
+
+

total: 0 errors, 0 warnings, 1 checks, 93 lines checked

checkpatch next bridge_loop_avoidance.c:
>>>>>>>>
CHECK: Please don't use multiple blank lines
#72: FILE: bridge_loop_avoidance.c:72:
+
+

CHECK: 'intialize' may be misspelled - perhaps 'initialize'?
#248: FILE: bridge_loop_avoidance.c:248:
+	/* all claims gone, intialize CRC */

CHECK: Please don't use multiple blank lines
#663: FILE: bridge_loop_avoidance.c:663:
+
+

CHECK: Please don't use multiple blank lines
#849: FILE: bridge_loop_avoidance.c:849:
+
+

CHECK: 'occurence' may be misspelled - perhaps 'occurrence'?
#1330: FILE: bridge_loop_avoidance.c:1330:
+	 * and allow it, its the first occurence.

CHECK: Please don't use multiple blank lines
#1346: FILE: bridge_loop_avoidance.c:1346:
+
+

CHECK: Please don't use multiple blank lines
#1389: FILE: bridge_loop_avoidance.c:1389:
+
+

CHECK: Please don't use multiple blank lines
#1479: FILE: bridge_loop_avoidance.c:1479:
+
+

total: 0 errors, 0 warnings, 8 checks, 1725 lines checked

checkpatch next debugfs.c:
>>>>>>>>
WARNING: void function return statements are not generally useful
#237: FILE: debugfs.c:237:
+	return;
+}

CHECK: Please use a blank line after function/struct/union/enum declarations
#408: FILE: debugfs.c:408:
+}
+static BATADV_HARDIF_DEBUGINFO(originators, S_IRUGO,

total: 0 errors, 1 warnings, 1 checks, 561 lines checked

checkpatch next distributed-arp-table.c:
>>>>>>>>
CHECK: Please use a blank line after function/struct/union/enum declarations
#1103: FILE: distributed-arp-table.c:1103:
+}
+/**

total: 0 errors, 0 warnings, 1 checks, 1203 lines checked

checkpatch next fragmentation.c:
>>>>>>>>
CHECK: Please don't use multiple blank lines
#26: FILE: fragmentation.c:26:
+
+

total: 0 errors, 0 warnings, 1 checks, 498 lines checked

checkpatch next gateway_client.c:
>>>>>>>>
CHECK: Please use a blank line after function/struct/union/enum declarations
#778: FILE: gateway_client.c:778:
+}
+/**

total: 0 errors, 0 warnings, 1 checks, 879 lines checked

checkpatch next main.c:
>>>>>>>>
CHECK: Please don't use multiple blank lines
#44: FILE: main.c:44:
+
+

CHECK: No space is necessary after a cast
#441: FILE: main.c:441:
+	BUILD_BUG_ON(sizeof(struct batadv_bla_claim_dst) != 6);

CHECK: No space is necessary after a cast
#442: FILE: main.c:442:
+	BUILD_BUG_ON(sizeof(struct batadv_ogm_packet) != 24);

CHECK: No space is necessary after a cast
#443: FILE: main.c:443:
+	BUILD_BUG_ON(sizeof(struct batadv_icmp_header) != 20);

CHECK: No space is necessary after a cast
#444: FILE: main.c:444:
+	BUILD_BUG_ON(sizeof(struct batadv_icmp_packet) != 20);

CHECK: No space is necessary after a cast
#445: FILE: main.c:445:
+	BUILD_BUG_ON(sizeof(struct batadv_icmp_packet_rr) != 116);

CHECK: No space is necessary after a cast
#446: FILE: main.c:446:
+	BUILD_BUG_ON(sizeof(struct batadv_unicast_packet) != 10);

CHECK: No space is necessary after a cast
#447: FILE: main.c:447:
+	BUILD_BUG_ON(sizeof(struct batadv_unicast_4addr_packet) != 18);

CHECK: No space is necessary after a cast
#448: FILE: main.c:448:
+	BUILD_BUG_ON(sizeof(struct batadv_frag_packet) != 20);

CHECK: No space is necessary after a cast
#449: FILE: main.c:449:
+	BUILD_BUG_ON(sizeof(struct batadv_bcast_packet) != 14);

CHECK: No space is necessary after a cast
#450: FILE: main.c:450:
+	BUILD_BUG_ON(sizeof(struct batadv_coded_packet) != 46);

CHECK: No space is necessary after a cast
#451: FILE: main.c:451:
+	BUILD_BUG_ON(sizeof(struct batadv_unicast_tvlv_packet) != 20);

CHECK: No space is necessary after a cast
#452: FILE: main.c:452:
+	BUILD_BUG_ON(sizeof(struct batadv_tvlv_hdr) != 4);

CHECK: No space is necessary after a cast
#453: FILE: main.c:453:
+	BUILD_BUG_ON(sizeof(struct batadv_tvlv_gateway_data) != 8);

CHECK: No space is necessary after a cast
#454: FILE: main.c:454:
+	BUILD_BUG_ON(sizeof(struct batadv_tvlv_tt_vlan_data) != 8);

CHECK: No space is necessary after a cast
#455: FILE: main.c:455:
+	BUILD_BUG_ON(sizeof(struct batadv_tvlv_tt_change) != 12);

CHECK: No space is necessary after a cast
#456: FILE: main.c:456:
+	BUILD_BUG_ON(sizeof(struct batadv_tvlv_roam_adv) != 8);

CHECK: 'accomodate' may be misspelled - perhaps 'accommodate'?
#802: FILE: main.c:802:
+ * batadv_tvlv_realloc_packet_buff - reallocate packet buffer to accomodate

total: 0 errors, 0 warnings, 18 checks, 1266 lines checked

checkpatch next multicast.h:
>>>>>>>>
WARNING: void function return statements are not generally useful
#54: FILE: multicast.h:54:
+	return;
+}

WARNING: void function return statements are not generally useful
#71: FILE: multicast.h:71:
+	return;
+}

WARNING: void function return statements are not generally useful
#76: FILE: multicast.h:76:
+	return;
+}

total: 0 errors, 3 warnings, 0 checks, 80 lines checked

checkpatch next originator.c:
>>>>>>>>
CHECK: Please don't use multiple blank lines
#803: FILE: originator.c:803:
+
+

total: 0 errors, 0 warnings, 1 checks, 1178 lines checked

checkpatch next originator.h:
>>>>>>>>
CHECK: Please don't use multiple blank lines
#73: FILE: originator.h:73:
+
+

total: 0 errors, 0 warnings, 1 checks, 126 lines checked

checkpatch next packet.h:
>>>>>>>>
CHECK: Please use a blank line after function/struct/union/enum declarations
#201: FILE: packet.h:201:
+};
+#pragma pack()

CHECK: 'endianess' may be misspelled - perhaps 'endianness'?
#379: FILE: packet.h:379:
+#error "unknown bitfield endianess"

CHECK: 'boundry' may be misspelled - perhaps 'boundary'?
#455: FILE: packet.h:455:
+ * @align: 2 bytes to align the header to a 4 byte boundry

total: 0 errors, 0 warnings, 3 checks, 552 lines checked

checkpatch next routing.c:
>>>>>>>>
CHECK: Please don't use multiple blank lines
#295: FILE: routing.c:295:
+
+

CHECK: 'choosen' may be misspelled - perhaps 'chosen'?
#458: FILE: routing.c:458:
+	 * If this can't be found either, return the previously choosen

total: 0 errors, 0 warnings, 2 checks, 1085 lines checked

checkpatch next soft-interface.c:
>>>>>>>>
CHECK: Please don't use multiple blank lines
#39: FILE: soft-interface.c:39:
+
+

CHECK: Comparison to NULL could be written "hard_iface->soft_iface"
#828: FILE: soft-interface.c:828:
+	if (!hard_iface || hard_iface->soft_iface != NULL)

total: 0 errors, 0 warnings, 2 checks, 1114 lines checked

checkpatch next sysfs.c:
>>>>>>>>
CHECK: Please don't use multiple blank lines
#154: FILE: sysfs.c:154:
+
+

total: 0 errors, 0 warnings, 1 checks, 944 lines checked

checkpatch next translation-table.c:
>>>>>>>>
CHECK: Please don't use multiple blank lines
#1783: FILE: translation-table.c:1783:
+
+

CHECK: 'adress' may be misspelled - perhaps 'address'?
#2857: FILE: translation-table.c:2857:
+ * @addr: the mac adress of the client to check

total: 0 errors, 0 warnings, 2 checks, 3712 lines checked

checkpatch next types.h:
>>>>>>>>
CHECK: 'occured' may be misspelled - perhaps 'occurred'?
#973: FILE: types.h:973:
+ * struct batadv_tt_change_node - structure for tt changes occured

total: 0 errors, 0 warnings, 1 checks, 1259 lines checked

sparse master linux-3.15 CONFIG_BATMAN_ADV_BLA=n CONFIG_BATMAN_ADV_DAT=y CONFIG_BATMAN_ADV_DEBUG=y CONFIG_BATMAN_ADV_NC=n CONFIG_BATMAN_ADV_MCAST=n:
>>>>>>>>
include/linux/rculist.h:402:9: warning: Variable length array is used.
include/linux/rculist.h:402:9: error: cannot size expression
include/linux/rculist.h:402:9: warning: Variable length array is used.
include/linux/rculist.h:402:9: error: cannot size expression
/home/batman/build_test/tmp/gateway_client.c:106:9: warning: Variable length array is used.
/home/batman/build_test/tmp/gateway_client.c:106:9: error: cannot size expression
include/linux/rculist.h:402:9: error: cannot size expression
/home/batman/build_test/tmp/hard-interface.c:194:9: warning: Variable length array is used.
/home/batman/build_test/tmp/hard-interface.c:194:9: error: cannot size expression
include/linux/rculist.h:54:9: error: cannot size expression
include/linux/rculist.h:402:9: warning: Variable length array is used.
include/linux/rculist.h:402:9: error: cannot size expression
include/linux/rculist.h:54:9: warning: Variable length array is used.
include/linux/rculist.h:54:9: error: cannot size expression
include/linux/rculist.h:402:9: error: cannot size expression
/home/batman/build_test/tmp/routing.c:91:9: warning: Variable length array is used.
/home/batman/build_test/tmp/routing.c:91:9: error: cannot size expression
include/linux/rculist.h:402:9: warning: Variable length array is used.
include/linux/rculist.h:402:9: error: cannot size expression
include/linux/rculist.h:402:9: warning: Variable length array is used.
include/linux/rculist.h:402:9: error: cannot size expression

sparse master linux-3.15 CONFIG_BATMAN_ADV_BLA=y CONFIG_BATMAN_ADV_DAT=n CONFIG_BATMAN_ADV_DEBUG=y CONFIG_BATMAN_ADV_NC=n CONFIG_BATMAN_ADV_MCAST=y:
>>>>>>>>
include/linux/rculist.h:402:9: warning: Variable length array is used.
include/linux/rculist.h:402:9: error: cannot size expression
include/linux/rculist.h:402:9: warning: Variable length array is used.
include/linux/rculist.h:402:9: error: cannot size expression
/home/batman/build_test/tmp/gateway_client.c:106:9: warning: Variable length array is used.
/home/batman/build_test/tmp/gateway_client.c:106:9: error: cannot size expression
include/linux/rculist.h:402:9: error: cannot size expression
/home/batman/build_test/tmp/hard-interface.c:194:9: warning: Variable length array is used.
/home/batman/build_test/tmp/hard-interface.c:194:9: error: cannot size expression
include/linux/rculist.h:54:9: error: cannot size expression
include/linux/rculist.h:402:9: warning: Variable length array is used.
include/linux/rculist.h:402:9: error: cannot size expression
include/linux/rculist.h:54:9: warning: Variable length array is used.
include/linux/rculist.h:54:9: error: cannot size expression
include/linux/rculist.h:402:9: error: cannot size expression
/home/batman/build_test/tmp/routing.c:91:9: warning: Variable length array is used.
/home/batman/build_test/tmp/routing.c:91:9: error: cannot size expression
include/linux/rculist.h:402:9: warning: Variable length array is used.
include/linux/rculist.h:402:9: error: cannot size expression
include/linux/rculist.h:402:9: warning: Variable length array is used.
include/linux/rculist.h:402:9: error: cannot size expression
include/linux/rculist.h:402:9: warning: Variable length array is used.
include/linux/rculist.h:402:9: error: cannot size expression

sparse master linux-3.15 CONFIG_BATMAN_ADV_BLA=y CONFIG_BATMAN_ADV_DAT=n CONFIG_BATMAN_ADV_DEBUG=y CONFIG_BATMAN_ADV_NC=y CONFIG_BATMAN_ADV_MCAST=y:
>>>>>>>>
include/linux/rculist.h:402:9: warning: Variable length array is used.
include/linux/rculist.h:402:9: error: cannot size expression
include/linux/rculist.h:402:9: warning: Variable length array is used.
include/linux/rculist.h:402:9: error: cannot size expression
/home/batman/build_test/tmp/gateway_client.c:106:9: warning: Variable length array is used.
/home/batman/build_test/tmp/gateway_client.c:106:9: error: cannot size expression
include/linux/rculist.h:402:9: error: cannot size expression
/home/batman/build_test/tmp/hard-interface.c:194:9: warning: Variable length array is used.
/home/batman/build_test/tmp/hard-interface.c:194:9: error: cannot size expression
include/linux/rculist.h:54:9: error: cannot size expression
include/linux/rculist.h:402:9: warning: Variable length array is used.
include/linux/rculist.h:402:9: error: cannot size expression
include/linux/rculist.h:54:9: warning: Variable length array is used.
include/linux/rculist.h:54:9: error: cannot size expression
include/linux/rculist.h:402:9: error: cannot size expression
include/linux/rculist.h:54:9: warning: Variable length array is used.
include/linux/rculist.h:54:9: error: cannot size expression
include/linux/rculist.h:402:9: error: cannot size expression
/home/batman/build_test/tmp/routing.c:91:9: warning: Variable length array is used.
/home/batman/build_test/tmp/routing.c:91:9: error: cannot size expression
include/linux/rculist.h:402:9: warning: Variable length array is used.
include/linux/rculist.h:402:9: error: cannot size expression
include/linux/rculist.h:402:9: warning: Variable length array is used.
include/linux/rculist.h:402:9: error: cannot size expression
include/linux/rculist.h:402:9: warning: Variable length array is used.
include/linux/rculist.h:402:9: error: cannot size expression

sparse next linux-3.15 CONFIG_BATMAN_ADV_BLA=n CONFIG_BATMAN_ADV_DAT=n CONFIG_BATMAN_ADV_DEBUG=n CONFIG_BATMAN_ADV_NC=n CONFIG_BATMAN_ADV_MCAST=n:
>>>>>>>>
include/linux/rculist.h:402:9: warning: Variable length array is used.
include/linux/rculist.h:402:9: error: cannot size expression
/home/batman/build_test/tmp/gateway_client.c:106:9: warning: Variable length array is used.
/home/batman/build_test/tmp/gateway_client.c:106:9: error: cannot size expression
include/linux/rculist.h:402:9: error: cannot size expression
/home/batman/build_test/tmp/hard-interface.c:194:9: warning: Variable length array is used.
/home/batman/build_test/tmp/hard-interface.c:194:9: error: cannot size expression
include/linux/rculist.h:54:9: error: cannot size expression
include/linux/rculist.h:402:9: warning: Variable length array is used.
include/linux/rculist.h:402:9: error: cannot size expression
include/linux/rculist.h:54:9: warning: Variable length array is used.
include/linux/rculist.h:54:9: error: cannot size expression
include/linux/rculist.h:402:9: error: cannot size expression
/home/batman/build_test/tmp/routing.c:91:9: warning: Variable length array is used.
/home/batman/build_test/tmp/routing.c:91:9: error: cannot size expression
include/linux/rculist.h:402:9: warning: Variable length array is used.
include/linux/rculist.h:402:9: error: cannot size expression
include/linux/rculist.h:402:9: warning: Variable length array is used.
include/linux/rculist.h:402:9: error: cannot size expression

sparse next linux-3.15 CONFIG_BATMAN_ADV_BLA=n CONFIG_BATMAN_ADV_DAT=n CONFIG_BATMAN_ADV_DEBUG=n CONFIG_BATMAN_ADV_NC=y CONFIG_BATMAN_ADV_MCAST=y:
>>>>>>>>
include/linux/rculist.h:402:9: warning: Variable length array is used.
include/linux/rculist.h:402:9: error: cannot size expression
/home/batman/build_test/tmp/gateway_client.c:106:9: warning: Variable length array is used.
/home/batman/build_test/tmp/gateway_client.c:106:9: error: cannot size expression
include/linux/rculist.h:402:9: error: cannot size expression
/home/batman/build_test/tmp/hard-interface.c:194:9: warning: Variable length array is used.
/home/batman/build_test/tmp/hard-interface.c:194:9: error: cannot size expression
include/linux/rculist.h:54:9: error: cannot size expression
include/linux/rculist.h:402:9: warning: Variable length array is used.
include/linux/rculist.h:402:9: error: cannot size expression
include/linux/rculist.h:54:9: warning: Variable length array is used.
include/linux/rculist.h:54:9: error: cannot size expression
include/linux/rculist.h:402:9: error: cannot size expression
include/linux/rculist.h:54:9: warning: Variable length array is used.
include/linux/rculist.h:54:9: error: cannot size expression
include/linux/rculist.h:402:9: error: cannot size expression
/home/batman/build_test/tmp/routing.c:91:9: warning: Variable length array is used.
/home/batman/build_test/tmp/routing.c:91:9: error: cannot size expression
include/linux/rculist.h:402:9: warning: Variable length array is used.
include/linux/rculist.h:402:9: error: cannot size expression
include/linux/rculist.h:402:9: warning: Variable length array is used.
include/linux/rculist.h:402:9: error: cannot size expression
include/linux/rculist.h:402:9: warning: Variable length array is used.
include/linux/rculist.h:402:9: error: cannot size expression

sparse next linux-3.15 CONFIG_BATMAN_ADV_BLA=y CONFIG_BATMAN_ADV_DAT=n CONFIG_BATMAN_ADV_DEBUG=y CONFIG_BATMAN_ADV_NC=y CONFIG_BATMAN_ADV_MCAST=n:
>>>>>>>>
include/linux/rculist.h:402:9: warning: Variable length array is used.
include/linux/rculist.h:402:9: error: cannot size expression
include/linux/rculist.h:402:9: warning: Variable length array is used.
include/linux/rculist.h:402:9: error: cannot size expression
/home/batman/build_test/tmp/gateway_client.c:106:9: warning: Variable length array is used.
/home/batman/build_test/tmp/gateway_client.c:106:9: error: cannot size expression
include/linux/rculist.h:402:9: error: cannot size expression
/home/batman/build_test/tmp/hard-interface.c:194:9: warning: Variable length array is used.
/home/batman/build_test/tmp/hard-interface.c:194:9: error: cannot size expression
include/linux/rculist.h:54:9: error: cannot size expression
include/linux/rculist.h:402:9: warning: Variable length array is used.
include/linux/rculist.h:402:9: error: cannot size expression
include/linux/rculist.h:54:9: warning: Variable length array is used.
include/linux/rculist.h:54:9: error: cannot size expression
include/linux/rculist.h:402:9: error: cannot size expression
include/linux/rculist.h:54:9: warning: Variable length array is used.
include/linux/rculist.h:54:9: error: cannot size expression
include/linux/rculist.h:402:9: error: cannot size expression
/home/batman/build_test/tmp/routing.c:91:9: warning: Variable length array is used.
/home/batman/build_test/tmp/routing.c:91:9: error: cannot size expression
include/linux/rculist.h:402:9: warning: Variable length array is used.
include/linux/rculist.h:402:9: error: cannot size expression
include/linux/rculist.h:402:9: warning: Variable length array is used.
include/linux/rculist.h:402:9: error: cannot size expression

sparse next linux-3.15 CONFIG_BATMAN_ADV_BLA=y CONFIG_BATMAN_ADV_DAT=y CONFIG_BATMAN_ADV_DEBUG=n CONFIG_BATMAN_ADV_NC=n CONFIG_BATMAN_ADV_MCAST=y:
>>>>>>>>
include/linux/rculist.h:402:9: warning: Variable length array is used.
include/linux/rculist.h:402:9: error: cannot size expression
include/linux/rculist.h:402:9: warning: Variable length array is used.
include/linux/rculist.h:402:9: error: cannot size expression
include/linux/rculist.h:402:9: warning: Variable length array is used.
include/linux/rculist.h:402:9: error: cannot size expression
/home/batman/build_test/tmp/gateway_client.c:106:9: warning: Variable length array is used.
/home/batman/build_test/tmp/gateway_client.c:106:9: error: cannot size expression
include/linux/rculist.h:402:9: error: cannot size expression
/home/batman/build_test/tmp/hard-interface.c:194:9: warning: Variable length array is used.
/home/batman/build_test/tmp/hard-interface.c:194:9: error: cannot size expression
include/linux/rculist.h:54:9: error: cannot size expression
include/linux/rculist.h:402:9: warning: Variable length array is used.
include/linux/rculist.h:402:9: error: cannot size expression
include/linux/rculist.h:54:9: warning: Variable length array is used.
include/linux/rculist.h:54:9: error: cannot size expression
include/linux/rculist.h:402:9: error: cannot size expression
/home/batman/build_test/tmp/routing.c:91:9: warning: Variable length array is used.
/home/batman/build_test/tmp/routing.c:91:9: error: cannot size expression
include/linux/rculist.h:402:9: warning: Variable length array is used.
include/linux/rculist.h:402:9: error: cannot size expression
include/linux/rculist.h:402:9: warning: Variable length array is used.
include/linux/rculist.h:402:9: error: cannot size expression
include/linux/rculist.h:402:9: warning: Variable length array is used.
include/linux/rculist.h:402:9: error: cannot size expression



More information about the linux-merge mailing list