Build check errors found: 2014-11-13

postmaster at open-mesh.org postmaster at open-mesh.org
Thu Nov 13 01:24:16 CET 2014


Name of failed tests
====================

Comment ending without space next
Comment starting with two asterisk non-empty line next
Multiline comment ending at a non-empty line next
Multiline comment starting with empty line next
bracket_align next *.c
bracket_align next *.h
checkpatch master bridge_loop_avoidance.c
checkpatch master debugfs.c
checkpatch master main.c
checkpatch master packet.h
checkpatch master routing.c
checkpatch master translation-table.c
checkpatch master types.h
checkpatch next checkstuff.sh
checkpatch next clean_sources.sh
checkpatch next cppcheck
checkpatch next error.db
checkpatch next find_unused_symbols.sh
checkpatch next generate_config_params.py
checkpatch next linux-build
checkpatch next linux-build.img
checkpatch next linux-next
checkpatch next mail
checkpatch next mail_aggregator.py
checkpatch next make_all.sh
checkpatch next minilinux
checkpatch next patches
checkpatch next smatch
checkpatch next sparse
sparse master linux-3.15 CONFIG_BATMAN_ADV_BLA=y CONFIG_BATMAN_ADV_DAT=n CONFIG_BATMAN_ADV_DEBUG=y CONFIG_BATMAN_ADV_NC=n CONFIG_BATMAN_ADV_MCAST=n
sparse master linux-3.15 CONFIG_BATMAN_ADV_BLA=y CONFIG_BATMAN_ADV_DAT=n CONFIG_BATMAN_ADV_DEBUG=y CONFIG_BATMAN_ADV_NC=n CONFIG_BATMAN_ADV_MCAST=y
sparse master linux-3.15 CONFIG_BATMAN_ADV_BLA=y CONFIG_BATMAN_ADV_DAT=y CONFIG_BATMAN_ADV_DEBUG=n CONFIG_BATMAN_ADV_NC=y CONFIG_BATMAN_ADV_MCAST=n
sparse master linux-3.15 CONFIG_BATMAN_ADV_BLA=y CONFIG_BATMAN_ADV_DAT=y CONFIG_BATMAN_ADV_DEBUG=y CONFIG_BATMAN_ADV_NC=y CONFIG_BATMAN_ADV_MCAST=y
sparse next linux-2.6.29 CONFIG_BATMAN_ADV_BLA=n CONFIG_BATMAN_ADV_DAT=n CONFIG_BATMAN_ADV_DEBUG=n CONFIG_BATMAN_ADV_NC=y CONFIG_BATMAN_ADV_MCAST=n
sparse next linux-2.6.29 CONFIG_BATMAN_ADV_BLA=n CONFIG_BATMAN_ADV_DAT=y CONFIG_BATMAN_ADV_DEBUG=n CONFIG_BATMAN_ADV_NC=y CONFIG_BATMAN_ADV_MCAST=n
sparse next linux-2.6.29 CONFIG_BATMAN_ADV_BLA=n CONFIG_BATMAN_ADV_DAT=y CONFIG_BATMAN_ADV_DEBUG=y CONFIG_BATMAN_ADV_NC=y CONFIG_BATMAN_ADV_MCAST=y
sparse next linux-2.6.30 CONFIG_BATMAN_ADV_BLA=n CONFIG_BATMAN_ADV_DAT=n CONFIG_BATMAN_ADV_DEBUG=n CONFIG_BATMAN_ADV_NC=y CONFIG_BATMAN_ADV_MCAST=n
sparse next linux-2.6.30 CONFIG_BATMAN_ADV_BLA=n CONFIG_BATMAN_ADV_DAT=y CONFIG_BATMAN_ADV_DEBUG=n CONFIG_BATMAN_ADV_NC=y CONFIG_BATMAN_ADV_MCAST=n
sparse next linux-2.6.30 CONFIG_BATMAN_ADV_BLA=n CONFIG_BATMAN_ADV_DAT=y CONFIG_BATMAN_ADV_DEBUG=y CONFIG_BATMAN_ADV_NC=y CONFIG_BATMAN_ADV_MCAST=y
sparse next linux-2.6.31 CONFIG_BATMAN_ADV_BLA=n CONFIG_BATMAN_ADV_DAT=n CONFIG_BATMAN_ADV_DEBUG=n CONFIG_BATMAN_ADV_NC=y CONFIG_BATMAN_ADV_MCAST=n
sparse next linux-2.6.31 CONFIG_BATMAN_ADV_BLA=n CONFIG_BATMAN_ADV_DAT=y CONFIG_BATMAN_ADV_DEBUG=n CONFIG_BATMAN_ADV_NC=y CONFIG_BATMAN_ADV_MCAST=n
sparse next linux-2.6.31 CONFIG_BATMAN_ADV_BLA=n CONFIG_BATMAN_ADV_DAT=y CONFIG_BATMAN_ADV_DEBUG=y CONFIG_BATMAN_ADV_NC=y CONFIG_BATMAN_ADV_MCAST=y
sparse next linux-2.6.32 CONFIG_BATMAN_ADV_BLA=n CONFIG_BATMAN_ADV_DAT=n CONFIG_BATMAN_ADV_DEBUG=n CONFIG_BATMAN_ADV_NC=y CONFIG_BATMAN_ADV_MCAST=n
sparse next linux-2.6.32 CONFIG_BATMAN_ADV_BLA=n CONFIG_BATMAN_ADV_DAT=y CONFIG_BATMAN_ADV_DEBUG=n CONFIG_BATMAN_ADV_NC=y CONFIG_BATMAN_ADV_MCAST=n
sparse next linux-2.6.32 CONFIG_BATMAN_ADV_BLA=n CONFIG_BATMAN_ADV_DAT=y CONFIG_BATMAN_ADV_DEBUG=y CONFIG_BATMAN_ADV_NC=y CONFIG_BATMAN_ADV_MCAST=y
sparse next linux-2.6.34 CONFIG_BATMAN_ADV_BLA=n CONFIG_BATMAN_ADV_DAT=n CONFIG_BATMAN_ADV_DEBUG=n CONFIG_BATMAN_ADV_NC=y CONFIG_BATMAN_ADV_MCAST=n
sparse next linux-2.6.34 CONFIG_BATMAN_ADV_BLA=n CONFIG_BATMAN_ADV_DAT=y CONFIG_BATMAN_ADV_DEBUG=n CONFIG_BATMAN_ADV_NC=y CONFIG_BATMAN_ADV_MCAST=n
sparse next linux-2.6.34 CONFIG_BATMAN_ADV_BLA=n CONFIG_BATMAN_ADV_DAT=y CONFIG_BATMAN_ADV_DEBUG=y CONFIG_BATMAN_ADV_NC=y CONFIG_BATMAN_ADV_MCAST=y
sparse next linux-2.6.35 CONFIG_BATMAN_ADV_BLA=n CONFIG_BATMAN_ADV_DAT=n CONFIG_BATMAN_ADV_DEBUG=n CONFIG_BATMAN_ADV_NC=y CONFIG_BATMAN_ADV_MCAST=n
sparse next linux-2.6.35 CONFIG_BATMAN_ADV_BLA=n CONFIG_BATMAN_ADV_DAT=y CONFIG_BATMAN_ADV_DEBUG=n CONFIG_BATMAN_ADV_NC=y CONFIG_BATMAN_ADV_MCAST=n
sparse next linux-2.6.35 CONFIG_BATMAN_ADV_BLA=n CONFIG_BATMAN_ADV_DAT=y CONFIG_BATMAN_ADV_DEBUG=y CONFIG_BATMAN_ADV_NC=y CONFIG_BATMAN_ADV_MCAST=y
sparse next linux-2.6.36 CONFIG_BATMAN_ADV_BLA=n CONFIG_BATMAN_ADV_DAT=n CONFIG_BATMAN_ADV_DEBUG=n CONFIG_BATMAN_ADV_NC=y CONFIG_BATMAN_ADV_MCAST=n
sparse next linux-2.6.36 CONFIG_BATMAN_ADV_BLA=n CONFIG_BATMAN_ADV_DAT=y CONFIG_BATMAN_ADV_DEBUG=n CONFIG_BATMAN_ADV_NC=y CONFIG_BATMAN_ADV_MCAST=n
sparse next linux-2.6.36 CONFIG_BATMAN_ADV_BLA=n CONFIG_BATMAN_ADV_DAT=y CONFIG_BATMAN_ADV_DEBUG=y CONFIG_BATMAN_ADV_NC=y CONFIG_BATMAN_ADV_MCAST=y
sparse next linux-2.6.37 CONFIG_BATMAN_ADV_BLA=n CONFIG_BATMAN_ADV_DAT=n CONFIG_BATMAN_ADV_DEBUG=n CONFIG_BATMAN_ADV_NC=y CONFIG_BATMAN_ADV_MCAST=n
sparse next linux-2.6.37 CONFIG_BATMAN_ADV_BLA=n CONFIG_BATMAN_ADV_DAT=y CONFIG_BATMAN_ADV_DEBUG=n CONFIG_BATMAN_ADV_NC=y CONFIG_BATMAN_ADV_MCAST=n
sparse next linux-2.6.37 CONFIG_BATMAN_ADV_BLA=n CONFIG_BATMAN_ADV_DAT=y CONFIG_BATMAN_ADV_DEBUG=y CONFIG_BATMAN_ADV_NC=y CONFIG_BATMAN_ADV_MCAST=y
sparse next linux-2.6.38 CONFIG_BATMAN_ADV_BLA=n CONFIG_BATMAN_ADV_DAT=n CONFIG_BATMAN_ADV_DEBUG=n CONFIG_BATMAN_ADV_NC=y CONFIG_BATMAN_ADV_MCAST=n
sparse next linux-2.6.38 CONFIG_BATMAN_ADV_BLA=n CONFIG_BATMAN_ADV_DAT=y CONFIG_BATMAN_ADV_DEBUG=n CONFIG_BATMAN_ADV_NC=y CONFIG_BATMAN_ADV_MCAST=n
sparse next linux-2.6.38 CONFIG_BATMAN_ADV_BLA=n CONFIG_BATMAN_ADV_DAT=y CONFIG_BATMAN_ADV_DEBUG=y CONFIG_BATMAN_ADV_NC=y CONFIG_BATMAN_ADV_MCAST=y
sparse next linux-2.6.39 CONFIG_BATMAN_ADV_BLA=n CONFIG_BATMAN_ADV_DAT=n CONFIG_BATMAN_ADV_DEBUG=n CONFIG_BATMAN_ADV_NC=y CONFIG_BATMAN_ADV_MCAST=n
sparse next linux-2.6.39 CONFIG_BATMAN_ADV_BLA=n CONFIG_BATMAN_ADV_DAT=y CONFIG_BATMAN_ADV_DEBUG=n CONFIG_BATMAN_ADV_NC=y CONFIG_BATMAN_ADV_MCAST=n
sparse next linux-2.6.39 CONFIG_BATMAN_ADV_BLA=n CONFIG_BATMAN_ADV_DAT=y CONFIG_BATMAN_ADV_DEBUG=y CONFIG_BATMAN_ADV_NC=y CONFIG_BATMAN_ADV_MCAST=y
sparse next linux-3.0 CONFIG_BATMAN_ADV_BLA=n CONFIG_BATMAN_ADV_DAT=n CONFIG_BATMAN_ADV_DEBUG=n CONFIG_BATMAN_ADV_NC=y CONFIG_BATMAN_ADV_MCAST=n
sparse next linux-3.0 CONFIG_BATMAN_ADV_BLA=n CONFIG_BATMAN_ADV_DAT=y CONFIG_BATMAN_ADV_DEBUG=n CONFIG_BATMAN_ADV_NC=y CONFIG_BATMAN_ADV_MCAST=n
sparse next linux-3.0 CONFIG_BATMAN_ADV_BLA=n CONFIG_BATMAN_ADV_DAT=y CONFIG_BATMAN_ADV_DEBUG=y CONFIG_BATMAN_ADV_NC=y CONFIG_BATMAN_ADV_MCAST=y
sparse next linux-3.1 CONFIG_BATMAN_ADV_BLA=n CONFIG_BATMAN_ADV_DAT=n CONFIG_BATMAN_ADV_DEBUG=n CONFIG_BATMAN_ADV_NC=y CONFIG_BATMAN_ADV_MCAST=n
sparse next linux-3.1 CONFIG_BATMAN_ADV_BLA=n CONFIG_BATMAN_ADV_DAT=y CONFIG_BATMAN_ADV_DEBUG=n CONFIG_BATMAN_ADV_NC=y CONFIG_BATMAN_ADV_MCAST=n
sparse next linux-3.1 CONFIG_BATMAN_ADV_BLA=n CONFIG_BATMAN_ADV_DAT=y CONFIG_BATMAN_ADV_DEBUG=y CONFIG_BATMAN_ADV_NC=y CONFIG_BATMAN_ADV_MCAST=y
sparse next linux-3.10 CONFIG_BATMAN_ADV_BLA=n CONFIG_BATMAN_ADV_DAT=n CONFIG_BATMAN_ADV_DEBUG=n CONFIG_BATMAN_ADV_NC=y CONFIG_BATMAN_ADV_MCAST=n
sparse next linux-3.10 CONFIG_BATMAN_ADV_BLA=n CONFIG_BATMAN_ADV_DAT=y CONFIG_BATMAN_ADV_DEBUG=n CONFIG_BATMAN_ADV_NC=y CONFIG_BATMAN_ADV_MCAST=n
sparse next linux-3.10 CONFIG_BATMAN_ADV_BLA=n CONFIG_BATMAN_ADV_DAT=y CONFIG_BATMAN_ADV_DEBUG=y CONFIG_BATMAN_ADV_NC=y CONFIG_BATMAN_ADV_MCAST=y
sparse next linux-3.11 CONFIG_BATMAN_ADV_BLA=n CONFIG_BATMAN_ADV_DAT=n CONFIG_BATMAN_ADV_DEBUG=n CONFIG_BATMAN_ADV_NC=y CONFIG_BATMAN_ADV_MCAST=n
sparse next linux-3.11 CONFIG_BATMAN_ADV_BLA=n CONFIG_BATMAN_ADV_DAT=y CONFIG_BATMAN_ADV_DEBUG=n CONFIG_BATMAN_ADV_NC=y CONFIG_BATMAN_ADV_MCAST=n
sparse next linux-3.11 CONFIG_BATMAN_ADV_BLA=n CONFIG_BATMAN_ADV_DAT=y CONFIG_BATMAN_ADV_DEBUG=y CONFIG_BATMAN_ADV_NC=y CONFIG_BATMAN_ADV_MCAST=y
sparse next linux-3.12 CONFIG_BATMAN_ADV_BLA=n CONFIG_BATMAN_ADV_DAT=n CONFIG_BATMAN_ADV_DEBUG=n CONFIG_BATMAN_ADV_NC=y CONFIG_BATMAN_ADV_MCAST=n
sparse next linux-3.12 CONFIG_BATMAN_ADV_BLA=n CONFIG_BATMAN_ADV_DAT=y CONFIG_BATMAN_ADV_DEBUG=n CONFIG_BATMAN_ADV_NC=y CONFIG_BATMAN_ADV_MCAST=n
sparse next linux-3.12 CONFIG_BATMAN_ADV_BLA=n CONFIG_BATMAN_ADV_DAT=y CONFIG_BATMAN_ADV_DEBUG=y CONFIG_BATMAN_ADV_NC=y CONFIG_BATMAN_ADV_MCAST=y
sparse next linux-3.13 CONFIG_BATMAN_ADV_BLA=n CONFIG_BATMAN_ADV_DAT=n CONFIG_BATMAN_ADV_DEBUG=n CONFIG_BATMAN_ADV_NC=y CONFIG_BATMAN_ADV_MCAST=n
sparse next linux-3.13 CONFIG_BATMAN_ADV_BLA=n CONFIG_BATMAN_ADV_DAT=y CONFIG_BATMAN_ADV_DEBUG=n CONFIG_BATMAN_ADV_NC=y CONFIG_BATMAN_ADV_MCAST=n
sparse next linux-3.13 CONFIG_BATMAN_ADV_BLA=n CONFIG_BATMAN_ADV_DAT=y CONFIG_BATMAN_ADV_DEBUG=y CONFIG_BATMAN_ADV_NC=y CONFIG_BATMAN_ADV_MCAST=y
sparse next linux-3.14 CONFIG_BATMAN_ADV_BLA=n CONFIG_BATMAN_ADV_DAT=n CONFIG_BATMAN_ADV_DEBUG=n CONFIG_BATMAN_ADV_NC=y CONFIG_BATMAN_ADV_MCAST=n
sparse next linux-3.14 CONFIG_BATMAN_ADV_BLA=n CONFIG_BATMAN_ADV_DAT=y CONFIG_BATMAN_ADV_DEBUG=n CONFIG_BATMAN_ADV_NC=y CONFIG_BATMAN_ADV_MCAST=n
sparse next linux-3.14 CONFIG_BATMAN_ADV_BLA=n CONFIG_BATMAN_ADV_DAT=y CONFIG_BATMAN_ADV_DEBUG=y CONFIG_BATMAN_ADV_NC=y CONFIG_BATMAN_ADV_MCAST=y
sparse next linux-3.15 CONFIG_BATMAN_ADV_BLA=n CONFIG_BATMAN_ADV_DAT=n CONFIG_BATMAN_ADV_DEBUG=n CONFIG_BATMAN_ADV_NC=y CONFIG_BATMAN_ADV_MCAST=n
sparse next linux-3.15 CONFIG_BATMAN_ADV_BLA=n CONFIG_BATMAN_ADV_DAT=y CONFIG_BATMAN_ADV_DEBUG=n CONFIG_BATMAN_ADV_NC=y CONFIG_BATMAN_ADV_MCAST=n
sparse next linux-3.15 CONFIG_BATMAN_ADV_BLA=n CONFIG_BATMAN_ADV_DAT=y CONFIG_BATMAN_ADV_DEBUG=y CONFIG_BATMAN_ADV_NC=y CONFIG_BATMAN_ADV_MCAST=y
sparse next linux-3.2 CONFIG_BATMAN_ADV_BLA=n CONFIG_BATMAN_ADV_DAT=n CONFIG_BATMAN_ADV_DEBUG=n CONFIG_BATMAN_ADV_NC=y CONFIG_BATMAN_ADV_MCAST=n
sparse next linux-3.2 CONFIG_BATMAN_ADV_BLA=n CONFIG_BATMAN_ADV_DAT=y CONFIG_BATMAN_ADV_DEBUG=n CONFIG_BATMAN_ADV_NC=y CONFIG_BATMAN_ADV_MCAST=n
sparse next linux-3.2 CONFIG_BATMAN_ADV_BLA=n CONFIG_BATMAN_ADV_DAT=y CONFIG_BATMAN_ADV_DEBUG=y CONFIG_BATMAN_ADV_NC=y CONFIG_BATMAN_ADV_MCAST=y
sparse next linux-3.3 CONFIG_BATMAN_ADV_BLA=n CONFIG_BATMAN_ADV_DAT=n CONFIG_BATMAN_ADV_DEBUG=n CONFIG_BATMAN_ADV_NC=y CONFIG_BATMAN_ADV_MCAST=n
sparse next linux-3.3 CONFIG_BATMAN_ADV_BLA=n CONFIG_BATMAN_ADV_DAT=y CONFIG_BATMAN_ADV_DEBUG=n CONFIG_BATMAN_ADV_NC=y CONFIG_BATMAN_ADV_MCAST=n
sparse next linux-3.3 CONFIG_BATMAN_ADV_BLA=n CONFIG_BATMAN_ADV_DAT=y CONFIG_BATMAN_ADV_DEBUG=y CONFIG_BATMAN_ADV_NC=y CONFIG_BATMAN_ADV_MCAST=y
sparse next linux-3.4 CONFIG_BATMAN_ADV_BLA=n CONFIG_BATMAN_ADV_DAT=n CONFIG_BATMAN_ADV_DEBUG=n CONFIG_BATMAN_ADV_NC=y CONFIG_BATMAN_ADV_MCAST=n
sparse next linux-3.4 CONFIG_BATMAN_ADV_BLA=n CONFIG_BATMAN_ADV_DAT=y CONFIG_BATMAN_ADV_DEBUG=n CONFIG_BATMAN_ADV_NC=y CONFIG_BATMAN_ADV_MCAST=n
sparse next linux-3.4 CONFIG_BATMAN_ADV_BLA=n CONFIG_BATMAN_ADV_DAT=y CONFIG_BATMAN_ADV_DEBUG=y CONFIG_BATMAN_ADV_NC=y CONFIG_BATMAN_ADV_MCAST=y
sparse next linux-3.5 CONFIG_BATMAN_ADV_BLA=n CONFIG_BATMAN_ADV_DAT=n CONFIG_BATMAN_ADV_DEBUG=n CONFIG_BATMAN_ADV_NC=y CONFIG_BATMAN_ADV_MCAST=n
sparse next linux-3.5 CONFIG_BATMAN_ADV_BLA=n CONFIG_BATMAN_ADV_DAT=y CONFIG_BATMAN_ADV_DEBUG=n CONFIG_BATMAN_ADV_NC=y CONFIG_BATMAN_ADV_MCAST=n
sparse next linux-3.5 CONFIG_BATMAN_ADV_BLA=n CONFIG_BATMAN_ADV_DAT=y CONFIG_BATMAN_ADV_DEBUG=y CONFIG_BATMAN_ADV_NC=y CONFIG_BATMAN_ADV_MCAST=y
sparse next linux-3.6 CONFIG_BATMAN_ADV_BLA=n CONFIG_BATMAN_ADV_DAT=n CONFIG_BATMAN_ADV_DEBUG=n CONFIG_BATMAN_ADV_NC=y CONFIG_BATMAN_ADV_MCAST=n
sparse next linux-3.6 CONFIG_BATMAN_ADV_BLA=n CONFIG_BATMAN_ADV_DAT=y CONFIG_BATMAN_ADV_DEBUG=n CONFIG_BATMAN_ADV_NC=y CONFIG_BATMAN_ADV_MCAST=n
sparse next linux-3.6 CONFIG_BATMAN_ADV_BLA=n CONFIG_BATMAN_ADV_DAT=y CONFIG_BATMAN_ADV_DEBUG=y CONFIG_BATMAN_ADV_NC=y CONFIG_BATMAN_ADV_MCAST=y
sparse next linux-3.7 CONFIG_BATMAN_ADV_BLA=n CONFIG_BATMAN_ADV_DAT=n CONFIG_BATMAN_ADV_DEBUG=n CONFIG_BATMAN_ADV_NC=y CONFIG_BATMAN_ADV_MCAST=n
sparse next linux-3.7 CONFIG_BATMAN_ADV_BLA=n CONFIG_BATMAN_ADV_DAT=y CONFIG_BATMAN_ADV_DEBUG=n CONFIG_BATMAN_ADV_NC=y CONFIG_BATMAN_ADV_MCAST=n
sparse next linux-3.7 CONFIG_BATMAN_ADV_BLA=n CONFIG_BATMAN_ADV_DAT=y CONFIG_BATMAN_ADV_DEBUG=y CONFIG_BATMAN_ADV_NC=y CONFIG_BATMAN_ADV_MCAST=y
sparse next linux-3.8 CONFIG_BATMAN_ADV_BLA=n CONFIG_BATMAN_ADV_DAT=n CONFIG_BATMAN_ADV_DEBUG=n CONFIG_BATMAN_ADV_NC=y CONFIG_BATMAN_ADV_MCAST=n
sparse next linux-3.8 CONFIG_BATMAN_ADV_BLA=n CONFIG_BATMAN_ADV_DAT=y CONFIG_BATMAN_ADV_DEBUG=n CONFIG_BATMAN_ADV_NC=y CONFIG_BATMAN_ADV_MCAST=n
sparse next linux-3.8 CONFIG_BATMAN_ADV_BLA=n CONFIG_BATMAN_ADV_DAT=y CONFIG_BATMAN_ADV_DEBUG=y CONFIG_BATMAN_ADV_NC=y CONFIG_BATMAN_ADV_MCAST=y
sparse next linux-3.9 CONFIG_BATMAN_ADV_BLA=n CONFIG_BATMAN_ADV_DAT=n CONFIG_BATMAN_ADV_DEBUG=n CONFIG_BATMAN_ADV_NC=y CONFIG_BATMAN_ADV_MCAST=n
sparse next linux-3.9 CONFIG_BATMAN_ADV_BLA=n CONFIG_BATMAN_ADV_DAT=y CONFIG_BATMAN_ADV_DEBUG=n CONFIG_BATMAN_ADV_NC=y CONFIG_BATMAN_ADV_MCAST=n
sparse next linux-3.9 CONFIG_BATMAN_ADV_BLA=n CONFIG_BATMAN_ADV_DAT=y CONFIG_BATMAN_ADV_DEBUG=y CONFIG_BATMAN_ADV_NC=y CONFIG_BATMAN_ADV_MCAST=y
wrong namespace symbols next linux-2.6.29 CONFIG_BATMAN_ADV_BLA=n CONFIG_BATMAN_ADV_DAT=n CONFIG_BATMAN_ADV_DEBUG=n CONFIG_BATMAN_ADV_NC=y CONFIG_BATMAN_ADV_MCAST=n
wrong namespace symbols next linux-2.6.29 CONFIG_BATMAN_ADV_BLA=n CONFIG_BATMAN_ADV_DAT=y CONFIG_BATMAN_ADV_DEBUG=n CONFIG_BATMAN_ADV_NC=y CONFIG_BATMAN_ADV_MCAST=n
wrong namespace symbols next linux-2.6.29 CONFIG_BATMAN_ADV_BLA=n CONFIG_BATMAN_ADV_DAT=y CONFIG_BATMAN_ADV_DEBUG=y CONFIG_BATMAN_ADV_NC=y CONFIG_BATMAN_ADV_MCAST=y
wrong namespace symbols next linux-2.6.30 CONFIG_BATMAN_ADV_BLA=n CONFIG_BATMAN_ADV_DAT=n CONFIG_BATMAN_ADV_DEBUG=n CONFIG_BATMAN_ADV_NC=y CONFIG_BATMAN_ADV_MCAST=n
wrong namespace symbols next linux-2.6.30 CONFIG_BATMAN_ADV_BLA=n CONFIG_BATMAN_ADV_DAT=y CONFIG_BATMAN_ADV_DEBUG=n CONFIG_BATMAN_ADV_NC=y CONFIG_BATMAN_ADV_MCAST=n
wrong namespace symbols next linux-2.6.30 CONFIG_BATMAN_ADV_BLA=n CONFIG_BATMAN_ADV_DAT=y CONFIG_BATMAN_ADV_DEBUG=y CONFIG_BATMAN_ADV_NC=y CONFIG_BATMAN_ADV_MCAST=y
wrong namespace symbols next linux-2.6.31 CONFIG_BATMAN_ADV_BLA=n CONFIG_BATMAN_ADV_DAT=n CONFIG_BATMAN_ADV_DEBUG=n CONFIG_BATMAN_ADV_NC=y CONFIG_BATMAN_ADV_MCAST=n
wrong namespace symbols next linux-2.6.31 CONFIG_BATMAN_ADV_BLA=n CONFIG_BATMAN_ADV_DAT=y CONFIG_BATMAN_ADV_DEBUG=n CONFIG_BATMAN_ADV_NC=y CONFIG_BATMAN_ADV_MCAST=n
wrong namespace symbols next linux-2.6.31 CONFIG_BATMAN_ADV_BLA=n CONFIG_BATMAN_ADV_DAT=y CONFIG_BATMAN_ADV_DEBUG=y CONFIG_BATMAN_ADV_NC=y CONFIG_BATMAN_ADV_MCAST=y
wrong namespace symbols next linux-2.6.32 CONFIG_BATMAN_ADV_BLA=n CONFIG_BATMAN_ADV_DAT=n CONFIG_BATMAN_ADV_DEBUG=n CONFIG_BATMAN_ADV_NC=y CONFIG_BATMAN_ADV_MCAST=n
wrong namespace symbols next linux-2.6.32 CONFIG_BATMAN_ADV_BLA=n CONFIG_BATMAN_ADV_DAT=y CONFIG_BATMAN_ADV_DEBUG=n CONFIG_BATMAN_ADV_NC=y CONFIG_BATMAN_ADV_MCAST=n
wrong namespace symbols next linux-2.6.32 CONFIG_BATMAN_ADV_BLA=n CONFIG_BATMAN_ADV_DAT=y CONFIG_BATMAN_ADV_DEBUG=y CONFIG_BATMAN_ADV_NC=y CONFIG_BATMAN_ADV_MCAST=y
wrong namespace symbols next linux-2.6.34 CONFIG_BATMAN_ADV_BLA=n CONFIG_BATMAN_ADV_DAT=n CONFIG_BATMAN_ADV_DEBUG=n CONFIG_BATMAN_ADV_NC=y CONFIG_BATMAN_ADV_MCAST=n
wrong namespace symbols next linux-2.6.34 CONFIG_BATMAN_ADV_BLA=n CONFIG_BATMAN_ADV_DAT=y CONFIG_BATMAN_ADV_DEBUG=n CONFIG_BATMAN_ADV_NC=y CONFIG_BATMAN_ADV_MCAST=n
wrong namespace symbols next linux-2.6.34 CONFIG_BATMAN_ADV_BLA=n CONFIG_BATMAN_ADV_DAT=y CONFIG_BATMAN_ADV_DEBUG=y CONFIG_BATMAN_ADV_NC=y CONFIG_BATMAN_ADV_MCAST=y
wrong namespace symbols next linux-2.6.35 CONFIG_BATMAN_ADV_BLA=n CONFIG_BATMAN_ADV_DAT=n CONFIG_BATMAN_ADV_DEBUG=n CONFIG_BATMAN_ADV_NC=y CONFIG_BATMAN_ADV_MCAST=n
wrong namespace symbols next linux-2.6.35 CONFIG_BATMAN_ADV_BLA=n CONFIG_BATMAN_ADV_DAT=y CONFIG_BATMAN_ADV_DEBUG=n CONFIG_BATMAN_ADV_NC=y CONFIG_BATMAN_ADV_MCAST=n
wrong namespace symbols next linux-2.6.35 CONFIG_BATMAN_ADV_BLA=n CONFIG_BATMAN_ADV_DAT=y CONFIG_BATMAN_ADV_DEBUG=y CONFIG_BATMAN_ADV_NC=y CONFIG_BATMAN_ADV_MCAST=y
wrong namespace symbols next linux-2.6.36 CONFIG_BATMAN_ADV_BLA=n CONFIG_BATMAN_ADV_DAT=n CONFIG_BATMAN_ADV_DEBUG=n CONFIG_BATMAN_ADV_NC=y CONFIG_BATMAN_ADV_MCAST=n
wrong namespace symbols next linux-2.6.36 CONFIG_BATMAN_ADV_BLA=n CONFIG_BATMAN_ADV_DAT=y CONFIG_BATMAN_ADV_DEBUG=n CONFIG_BATMAN_ADV_NC=y CONFIG_BATMAN_ADV_MCAST=n
wrong namespace symbols next linux-2.6.36 CONFIG_BATMAN_ADV_BLA=n CONFIG_BATMAN_ADV_DAT=y CONFIG_BATMAN_ADV_DEBUG=y CONFIG_BATMAN_ADV_NC=y CONFIG_BATMAN_ADV_MCAST=y
wrong namespace symbols next linux-2.6.37 CONFIG_BATMAN_ADV_BLA=n CONFIG_BATMAN_ADV_DAT=n CONFIG_BATMAN_ADV_DEBUG=n CONFIG_BATMAN_ADV_NC=y CONFIG_BATMAN_ADV_MCAST=n
wrong namespace symbols next linux-2.6.37 CONFIG_BATMAN_ADV_BLA=n CONFIG_BATMAN_ADV_DAT=y CONFIG_BATMAN_ADV_DEBUG=n CONFIG_BATMAN_ADV_NC=y CONFIG_BATMAN_ADV_MCAST=n
wrong namespace symbols next linux-2.6.37 CONFIG_BATMAN_ADV_BLA=n CONFIG_BATMAN_ADV_DAT=y CONFIG_BATMAN_ADV_DEBUG=y CONFIG_BATMAN_ADV_NC=y CONFIG_BATMAN_ADV_MCAST=y
wrong namespace symbols next linux-2.6.38 CONFIG_BATMAN_ADV_BLA=n CONFIG_BATMAN_ADV_DAT=n CONFIG_BATMAN_ADV_DEBUG=n CONFIG_BATMAN_ADV_NC=y CONFIG_BATMAN_ADV_MCAST=n
wrong namespace symbols next linux-2.6.38 CONFIG_BATMAN_ADV_BLA=n CONFIG_BATMAN_ADV_DAT=y CONFIG_BATMAN_ADV_DEBUG=n CONFIG_BATMAN_ADV_NC=y CONFIG_BATMAN_ADV_MCAST=n
wrong namespace symbols next linux-2.6.38 CONFIG_BATMAN_ADV_BLA=n CONFIG_BATMAN_ADV_DAT=y CONFIG_BATMAN_ADV_DEBUG=y CONFIG_BATMAN_ADV_NC=y CONFIG_BATMAN_ADV_MCAST=y
wrong namespace symbols next linux-2.6.39 CONFIG_BATMAN_ADV_BLA=n CONFIG_BATMAN_ADV_DAT=n CONFIG_BATMAN_ADV_DEBUG=n CONFIG_BATMAN_ADV_NC=y CONFIG_BATMAN_ADV_MCAST=n
wrong namespace symbols next linux-2.6.39 CONFIG_BATMAN_ADV_BLA=n CONFIG_BATMAN_ADV_DAT=y CONFIG_BATMAN_ADV_DEBUG=n CONFIG_BATMAN_ADV_NC=y CONFIG_BATMAN_ADV_MCAST=n
wrong namespace symbols next linux-2.6.39 CONFIG_BATMAN_ADV_BLA=n CONFIG_BATMAN_ADV_DAT=y CONFIG_BATMAN_ADV_DEBUG=y CONFIG_BATMAN_ADV_NC=y CONFIG_BATMAN_ADV_MCAST=y
wrong namespace symbols next linux-3.0 CONFIG_BATMAN_ADV_BLA=n CONFIG_BATMAN_ADV_DAT=n CONFIG_BATMAN_ADV_DEBUG=n CONFIG_BATMAN_ADV_NC=y CONFIG_BATMAN_ADV_MCAST=n
wrong namespace symbols next linux-3.0 CONFIG_BATMAN_ADV_BLA=n CONFIG_BATMAN_ADV_DAT=y CONFIG_BATMAN_ADV_DEBUG=n CONFIG_BATMAN_ADV_NC=y CONFIG_BATMAN_ADV_MCAST=n
wrong namespace symbols next linux-3.0 CONFIG_BATMAN_ADV_BLA=n CONFIG_BATMAN_ADV_DAT=y CONFIG_BATMAN_ADV_DEBUG=y CONFIG_BATMAN_ADV_NC=y CONFIG_BATMAN_ADV_MCAST=y
wrong namespace symbols next linux-3.1 CONFIG_BATMAN_ADV_BLA=n CONFIG_BATMAN_ADV_DAT=n CONFIG_BATMAN_ADV_DEBUG=n CONFIG_BATMAN_ADV_NC=y CONFIG_BATMAN_ADV_MCAST=n
wrong namespace symbols next linux-3.1 CONFIG_BATMAN_ADV_BLA=n CONFIG_BATMAN_ADV_DAT=y CONFIG_BATMAN_ADV_DEBUG=n CONFIG_BATMAN_ADV_NC=y CONFIG_BATMAN_ADV_MCAST=n
wrong namespace symbols next linux-3.1 CONFIG_BATMAN_ADV_BLA=n CONFIG_BATMAN_ADV_DAT=y CONFIG_BATMAN_ADV_DEBUG=y CONFIG_BATMAN_ADV_NC=y CONFIG_BATMAN_ADV_MCAST=y
wrong namespace symbols next linux-3.10 CONFIG_BATMAN_ADV_BLA=n CONFIG_BATMAN_ADV_DAT=n CONFIG_BATMAN_ADV_DEBUG=n CONFIG_BATMAN_ADV_NC=y CONFIG_BATMAN_ADV_MCAST=n
wrong namespace symbols next linux-3.10 CONFIG_BATMAN_ADV_BLA=n CONFIG_BATMAN_ADV_DAT=y CONFIG_BATMAN_ADV_DEBUG=n CONFIG_BATMAN_ADV_NC=y CONFIG_BATMAN_ADV_MCAST=n
wrong namespace symbols next linux-3.10 CONFIG_BATMAN_ADV_BLA=n CONFIG_BATMAN_ADV_DAT=y CONFIG_BATMAN_ADV_DEBUG=y CONFIG_BATMAN_ADV_NC=y CONFIG_BATMAN_ADV_MCAST=y
wrong namespace symbols next linux-3.11 CONFIG_BATMAN_ADV_BLA=n CONFIG_BATMAN_ADV_DAT=n CONFIG_BATMAN_ADV_DEBUG=n CONFIG_BATMAN_ADV_NC=y CONFIG_BATMAN_ADV_MCAST=n
wrong namespace symbols next linux-3.11 CONFIG_BATMAN_ADV_BLA=n CONFIG_BATMAN_ADV_DAT=y CONFIG_BATMAN_ADV_DEBUG=n CONFIG_BATMAN_ADV_NC=y CONFIG_BATMAN_ADV_MCAST=n
wrong namespace symbols next linux-3.11 CONFIG_BATMAN_ADV_BLA=n CONFIG_BATMAN_ADV_DAT=y CONFIG_BATMAN_ADV_DEBUG=y CONFIG_BATMAN_ADV_NC=y CONFIG_BATMAN_ADV_MCAST=y
wrong namespace symbols next linux-3.12 CONFIG_BATMAN_ADV_BLA=n CONFIG_BATMAN_ADV_DAT=n CONFIG_BATMAN_ADV_DEBUG=n CONFIG_BATMAN_ADV_NC=y CONFIG_BATMAN_ADV_MCAST=n
wrong namespace symbols next linux-3.12 CONFIG_BATMAN_ADV_BLA=n CONFIG_BATMAN_ADV_DAT=y CONFIG_BATMAN_ADV_DEBUG=n CONFIG_BATMAN_ADV_NC=y CONFIG_BATMAN_ADV_MCAST=n
wrong namespace symbols next linux-3.12 CONFIG_BATMAN_ADV_BLA=n CONFIG_BATMAN_ADV_DAT=y CONFIG_BATMAN_ADV_DEBUG=y CONFIG_BATMAN_ADV_NC=y CONFIG_BATMAN_ADV_MCAST=y
wrong namespace symbols next linux-3.13 CONFIG_BATMAN_ADV_BLA=n CONFIG_BATMAN_ADV_DAT=n CONFIG_BATMAN_ADV_DEBUG=n CONFIG_BATMAN_ADV_NC=y CONFIG_BATMAN_ADV_MCAST=n
wrong namespace symbols next linux-3.13 CONFIG_BATMAN_ADV_BLA=n CONFIG_BATMAN_ADV_DAT=y CONFIG_BATMAN_ADV_DEBUG=n CONFIG_BATMAN_ADV_NC=y CONFIG_BATMAN_ADV_MCAST=n
wrong namespace symbols next linux-3.13 CONFIG_BATMAN_ADV_BLA=n CONFIG_BATMAN_ADV_DAT=y CONFIG_BATMAN_ADV_DEBUG=y CONFIG_BATMAN_ADV_NC=y CONFIG_BATMAN_ADV_MCAST=y
wrong namespace symbols next linux-3.14 CONFIG_BATMAN_ADV_BLA=n CONFIG_BATMAN_ADV_DAT=n CONFIG_BATMAN_ADV_DEBUG=n CONFIG_BATMAN_ADV_NC=y CONFIG_BATMAN_ADV_MCAST=n
wrong namespace symbols next linux-3.14 CONFIG_BATMAN_ADV_BLA=n CONFIG_BATMAN_ADV_DAT=y CONFIG_BATMAN_ADV_DEBUG=n CONFIG_BATMAN_ADV_NC=y CONFIG_BATMAN_ADV_MCAST=n
wrong namespace symbols next linux-3.14 CONFIG_BATMAN_ADV_BLA=n CONFIG_BATMAN_ADV_DAT=y CONFIG_BATMAN_ADV_DEBUG=y CONFIG_BATMAN_ADV_NC=y CONFIG_BATMAN_ADV_MCAST=y
wrong namespace symbols next linux-3.15 CONFIG_BATMAN_ADV_BLA=n CONFIG_BATMAN_ADV_DAT=n CONFIG_BATMAN_ADV_DEBUG=n CONFIG_BATMAN_ADV_NC=y CONFIG_BATMAN_ADV_MCAST=n
wrong namespace symbols next linux-3.15 CONFIG_BATMAN_ADV_BLA=n CONFIG_BATMAN_ADV_DAT=y CONFIG_BATMAN_ADV_DEBUG=n CONFIG_BATMAN_ADV_NC=y CONFIG_BATMAN_ADV_MCAST=n
wrong namespace symbols next linux-3.15 CONFIG_BATMAN_ADV_BLA=n CONFIG_BATMAN_ADV_DAT=y CONFIG_BATMAN_ADV_DEBUG=y CONFIG_BATMAN_ADV_NC=y CONFIG_BATMAN_ADV_MCAST=y
wrong namespace symbols next linux-3.2 CONFIG_BATMAN_ADV_BLA=n CONFIG_BATMAN_ADV_DAT=n CONFIG_BATMAN_ADV_DEBUG=n CONFIG_BATMAN_ADV_NC=y CONFIG_BATMAN_ADV_MCAST=n
wrong namespace symbols next linux-3.2 CONFIG_BATMAN_ADV_BLA=n CONFIG_BATMAN_ADV_DAT=y CONFIG_BATMAN_ADV_DEBUG=n CONFIG_BATMAN_ADV_NC=y CONFIG_BATMAN_ADV_MCAST=n
wrong namespace symbols next linux-3.2 CONFIG_BATMAN_ADV_BLA=n CONFIG_BATMAN_ADV_DAT=y CONFIG_BATMAN_ADV_DEBUG=y CONFIG_BATMAN_ADV_NC=y CONFIG_BATMAN_ADV_MCAST=y
wrong namespace symbols next linux-3.3 CONFIG_BATMAN_ADV_BLA=n CONFIG_BATMAN_ADV_DAT=n CONFIG_BATMAN_ADV_DEBUG=n CONFIG_BATMAN_ADV_NC=y CONFIG_BATMAN_ADV_MCAST=n
wrong namespace symbols next linux-3.3 CONFIG_BATMAN_ADV_BLA=n CONFIG_BATMAN_ADV_DAT=y CONFIG_BATMAN_ADV_DEBUG=n CONFIG_BATMAN_ADV_NC=y CONFIG_BATMAN_ADV_MCAST=n
wrong namespace symbols next linux-3.3 CONFIG_BATMAN_ADV_BLA=n CONFIG_BATMAN_ADV_DAT=y CONFIG_BATMAN_ADV_DEBUG=y CONFIG_BATMAN_ADV_NC=y CONFIG_BATMAN_ADV_MCAST=y
wrong namespace symbols next linux-3.4 CONFIG_BATMAN_ADV_BLA=n CONFIG_BATMAN_ADV_DAT=n CONFIG_BATMAN_ADV_DEBUG=n CONFIG_BATMAN_ADV_NC=y CONFIG_BATMAN_ADV_MCAST=n
wrong namespace symbols next linux-3.4 CONFIG_BATMAN_ADV_BLA=n CONFIG_BATMAN_ADV_DAT=y CONFIG_BATMAN_ADV_DEBUG=n CONFIG_BATMAN_ADV_NC=y CONFIG_BATMAN_ADV_MCAST=n
wrong namespace symbols next linux-3.4 CONFIG_BATMAN_ADV_BLA=n CONFIG_BATMAN_ADV_DAT=y CONFIG_BATMAN_ADV_DEBUG=y CONFIG_BATMAN_ADV_NC=y CONFIG_BATMAN_ADV_MCAST=y
wrong namespace symbols next linux-3.5 CONFIG_BATMAN_ADV_BLA=n CONFIG_BATMAN_ADV_DAT=n CONFIG_BATMAN_ADV_DEBUG=n CONFIG_BATMAN_ADV_NC=y CONFIG_BATMAN_ADV_MCAST=n
wrong namespace symbols next linux-3.5 CONFIG_BATMAN_ADV_BLA=n CONFIG_BATMAN_ADV_DAT=y CONFIG_BATMAN_ADV_DEBUG=n CONFIG_BATMAN_ADV_NC=y CONFIG_BATMAN_ADV_MCAST=n
wrong namespace symbols next linux-3.5 CONFIG_BATMAN_ADV_BLA=n CONFIG_BATMAN_ADV_DAT=y CONFIG_BATMAN_ADV_DEBUG=y CONFIG_BATMAN_ADV_NC=y CONFIG_BATMAN_ADV_MCAST=y
wrong namespace symbols next linux-3.6 CONFIG_BATMAN_ADV_BLA=n CONFIG_BATMAN_ADV_DAT=n CONFIG_BATMAN_ADV_DEBUG=n CONFIG_BATMAN_ADV_NC=y CONFIG_BATMAN_ADV_MCAST=n
wrong namespace symbols next linux-3.6 CONFIG_BATMAN_ADV_BLA=n CONFIG_BATMAN_ADV_DAT=y CONFIG_BATMAN_ADV_DEBUG=n CONFIG_BATMAN_ADV_NC=y CONFIG_BATMAN_ADV_MCAST=n
wrong namespace symbols next linux-3.6 CONFIG_BATMAN_ADV_BLA=n CONFIG_BATMAN_ADV_DAT=y CONFIG_BATMAN_ADV_DEBUG=y CONFIG_BATMAN_ADV_NC=y CONFIG_BATMAN_ADV_MCAST=y
wrong namespace symbols next linux-3.7 CONFIG_BATMAN_ADV_BLA=n CONFIG_BATMAN_ADV_DAT=n CONFIG_BATMAN_ADV_DEBUG=n CONFIG_BATMAN_ADV_NC=y CONFIG_BATMAN_ADV_MCAST=n
wrong namespace symbols next linux-3.7 CONFIG_BATMAN_ADV_BLA=n CONFIG_BATMAN_ADV_DAT=y CONFIG_BATMAN_ADV_DEBUG=n CONFIG_BATMAN_ADV_NC=y CONFIG_BATMAN_ADV_MCAST=n
wrong namespace symbols next linux-3.7 CONFIG_BATMAN_ADV_BLA=n CONFIG_BATMAN_ADV_DAT=y CONFIG_BATMAN_ADV_DEBUG=y CONFIG_BATMAN_ADV_NC=y CONFIG_BATMAN_ADV_MCAST=y
wrong namespace symbols next linux-3.8 CONFIG_BATMAN_ADV_BLA=n CONFIG_BATMAN_ADV_DAT=n CONFIG_BATMAN_ADV_DEBUG=n CONFIG_BATMAN_ADV_NC=y CONFIG_BATMAN_ADV_MCAST=n
wrong namespace symbols next linux-3.8 CONFIG_BATMAN_ADV_BLA=n CONFIG_BATMAN_ADV_DAT=y CONFIG_BATMAN_ADV_DEBUG=n CONFIG_BATMAN_ADV_NC=y CONFIG_BATMAN_ADV_MCAST=n
wrong namespace symbols next linux-3.8 CONFIG_BATMAN_ADV_BLA=n CONFIG_BATMAN_ADV_DAT=y CONFIG_BATMAN_ADV_DEBUG=y CONFIG_BATMAN_ADV_NC=y CONFIG_BATMAN_ADV_MCAST=y
wrong namespace symbols next linux-3.9 CONFIG_BATMAN_ADV_BLA=n CONFIG_BATMAN_ADV_DAT=n CONFIG_BATMAN_ADV_DEBUG=n CONFIG_BATMAN_ADV_NC=y CONFIG_BATMAN_ADV_MCAST=n
wrong namespace symbols next linux-3.9 CONFIG_BATMAN_ADV_BLA=n CONFIG_BATMAN_ADV_DAT=y CONFIG_BATMAN_ADV_DEBUG=n CONFIG_BATMAN_ADV_NC=y CONFIG_BATMAN_ADV_MCAST=n
wrong namespace symbols next linux-3.9 CONFIG_BATMAN_ADV_BLA=n CONFIG_BATMAN_ADV_DAT=y CONFIG_BATMAN_ADV_DEBUG=y CONFIG_BATMAN_ADV_NC=y CONFIG_BATMAN_ADV_MCAST=y

Output of different failed tests
================================

Multiline comment starting with empty line next:
>>>>>>>>
grep: *.c: No such file or directory
grep: *.h: No such file or directory

bracket_align next *.c:
>>>>>>>>
Traceback (most recent call last):
  File "/home/batman/build_test/bracket_align.py", line 125, in <module>
    main()
  File "/home/batman/build_test/bracket_align.py", line 85, in main
    lines = open(sys.argv[1]).readlines()
IOError: [Errno 2] No such file or directory: '*.c'

bracket_align next *.h:
>>>>>>>>
Traceback (most recent call last):
  File "/home/batman/build_test/bracket_align.py", line 125, in <module>
    main()
  File "/home/batman/build_test/bracket_align.py", line 85, in main
    lines = open(sys.argv[1]).readlines()
IOError: [Errno 2] No such file or directory: '*.h'

checkpatch master bridge_loop_avoidance.c:
>>>>>>>>
CHECK: 'intialize' may be misspelled - perhaps 'initialize'?
#247: FILE: bridge_loop_avoidance.c:247:
+	/* all claims gone, intialize CRC */

CHECK: 'occurence' may be misspelled - perhaps 'occurrence'?
#1331: FILE: bridge_loop_avoidance.c:1331:
+	 * and allow it, its the first occurence.

total: 0 errors, 0 warnings, 2 checks, 1722 lines checked

checkpatch master debugfs.c:
>>>>>>>>
WARNING: void function return statements are not generally useful
#237: FILE: debugfs.c:237:
+	return;
+}

total: 0 errors, 1 warnings, 0 checks, 562 lines checked

checkpatch master main.c:
>>>>>>>>
CHECK: No space is necessary after a cast
#440: FILE: main.c:440:
+	BUILD_BUG_ON(sizeof(struct batadv_bla_claim_dst) != 6);

CHECK: No space is necessary after a cast
#441: FILE: main.c:441:
+	BUILD_BUG_ON(sizeof(struct batadv_ogm_packet) != 24);

CHECK: No space is necessary after a cast
#442: FILE: main.c:442:
+	BUILD_BUG_ON(sizeof(struct batadv_icmp_header) != 20);

CHECK: No space is necessary after a cast
#443: FILE: main.c:443:
+	BUILD_BUG_ON(sizeof(struct batadv_icmp_packet) != 20);

CHECK: No space is necessary after a cast
#444: FILE: main.c:444:
+	BUILD_BUG_ON(sizeof(struct batadv_icmp_packet_rr) != 116);

CHECK: No space is necessary after a cast
#445: FILE: main.c:445:
+	BUILD_BUG_ON(sizeof(struct batadv_unicast_packet) != 10);

CHECK: No space is necessary after a cast
#446: FILE: main.c:446:
+	BUILD_BUG_ON(sizeof(struct batadv_unicast_4addr_packet) != 18);

CHECK: No space is necessary after a cast
#447: FILE: main.c:447:
+	BUILD_BUG_ON(sizeof(struct batadv_frag_packet) != 20);

CHECK: No space is necessary after a cast
#448: FILE: main.c:448:
+	BUILD_BUG_ON(sizeof(struct batadv_bcast_packet) != 14);

CHECK: No space is necessary after a cast
#449: FILE: main.c:449:
+	BUILD_BUG_ON(sizeof(struct batadv_coded_packet) != 46);

CHECK: No space is necessary after a cast
#450: FILE: main.c:450:
+	BUILD_BUG_ON(sizeof(struct batadv_unicast_tvlv_packet) != 20);

CHECK: No space is necessary after a cast
#451: FILE: main.c:451:
+	BUILD_BUG_ON(sizeof(struct batadv_tvlv_hdr) != 4);

CHECK: No space is necessary after a cast
#452: FILE: main.c:452:
+	BUILD_BUG_ON(sizeof(struct batadv_tvlv_gateway_data) != 8);

CHECK: No space is necessary after a cast
#453: FILE: main.c:453:
+	BUILD_BUG_ON(sizeof(struct batadv_tvlv_tt_vlan_data) != 8);

CHECK: No space is necessary after a cast
#454: FILE: main.c:454:
+	BUILD_BUG_ON(sizeof(struct batadv_tvlv_tt_change) != 12);

CHECK: No space is necessary after a cast
#455: FILE: main.c:455:
+	BUILD_BUG_ON(sizeof(struct batadv_tvlv_roam_adv) != 8);

CHECK: 'accomodate' may be misspelled - perhaps 'accommodate'?
#801: FILE: main.c:801:
+ * batadv_tvlv_realloc_packet_buff - reallocate packet buffer to accomodate

total: 0 errors, 0 warnings, 17 checks, 1265 lines checked

checkpatch master packet.h:
>>>>>>>>
CHECK: 'endianess' may be misspelled - perhaps 'endianness'?
#380: FILE: packet.h:380:
+#error "unknown bitfield endianess"

CHECK: 'boundry' may be misspelled - perhaps 'boundary'?
#456: FILE: packet.h:456:
+ * @align: 2 bytes to align the header to a 4 byte boundry

total: 0 errors, 0 warnings, 2 checks, 553 lines checked

checkpatch master routing.c:
>>>>>>>>
CHECK: 'choosen' may be misspelled - perhaps 'chosen'?
#459: FILE: routing.c:459:
+	 * If this can't be found either, return the previously choosen

total: 0 errors, 0 warnings, 1 checks, 1086 lines checked

checkpatch master translation-table.c:
>>>>>>>>
CHECK: 'adress' may be misspelled - perhaps 'address'?
#2855: FILE: translation-table.c:2855:
+ * @addr: the mac adress of the client to check

total: 0 errors, 0 warnings, 1 checks, 3710 lines checked

checkpatch master types.h:
>>>>>>>>
CHECK: 'occured' may be misspelled - perhaps 'occurred'?
#971: FILE: types.h:971:
+ * struct batadv_tt_change_node - structure for tt changes occured

total: 0 errors, 0 warnings, 1 checks, 1257 lines checked

checkpatch next checkstuff.sh:
>>>>>>>>
WARNING: line over 80 characters
#34: FILE: checkstuff.sh:34:
+	("${CPPCHECK}" --error-exitcode=42 -I../minilinux/ --enable=all --suppress=variableScope . 3>&2 2>&1 1>&3 \

WARNING: line over 80 characters
#35: FILE: checkstuff.sh:35:
+				| grep -v "gateway_client.c.*max_gw_factor.* is assigned a value that is never used" \

WARNING: line over 80 characters
#36: FILE: checkstuff.sh:36:
+				| grep -v "gateway_client.c.*max_tq.* is assigned a value that is never used" \

WARNING: line over 80 characters
#37: FILE: checkstuff.sh:37:
+				| grep -v "translation-table.c.*best_tq.* is assigned a value that is never used" \

WARNING: line over 80 characters
#38: FILE: checkstuff.sh:38:
+				| grep -v "main.c.*tvlv_value.* is assigned a value that is never used" \

WARNING: line over 80 characters
#39: FILE: checkstuff.sh:39:
+				| grep -v "bridge_loop_avoidance.c.* The function 'batadv_bla_backbone_table_seq_print_text' is never used" \

WARNING: line over 80 characters
#40: FILE: checkstuff.sh:40:
+				| grep -v "bridge_loop_avoidance.c.* The function 'batadv_bla_claim_table_seq_print_text' is never used" \

WARNING: line over 80 characters
#41: FILE: checkstuff.sh:41:
+				| grep -v "distributed-arp-table.c.* The function 'batadv_dat_cache_seq_print_text' is never used" \

WARNING: line over 80 characters
#42: FILE: checkstuff.sh:42:
+				| grep -v "distributed-arp-table.c.* The function 'batadv_dat_status_update' is never used" \

WARNING: line over 80 characters
#43: FILE: checkstuff.sh:43:
+				| grep -v "[network-coding.c.* The function 'batadv_nc_nodes_seq_print_text' is never used" \

WARNING: line over 80 characters
#44: FILE: checkstuff.sh:44:
+				| grep -v "[network-coding.c.* The function 'batadv_nc_status_update' is never used" \

WARNING: line over 80 characters
#58: FILE: checkstuff.sh:58:
+		"${MAIL_AGGREGATOR}" "${DB}" add "Multiline comment ending at a non-empty line $branch" log log

WARNING: line over 80 characters
#63: FILE: checkstuff.sh:63:
+		"${MAIL_AGGREGATOR}" "${DB}" add "Comment starting with two asterisk non-empty line $branch" log log

WARNING: line over 80 characters
#68: FILE: checkstuff.sh:68:
+		"${MAIL_AGGREGATOR}" "${DB}" add "Comment ending without space $branch" log log

WARNING: line over 80 characters
#73: FILE: checkstuff.sh:73:
+		"${MAIL_AGGREGATOR}" "${DB}" add "Multiline comment starting with empty line $branch" log log

WARNING: line over 80 characters
#83: FILE: checkstuff.sh:83:
+		if [ "$i" != "compat.c" -a "$i" != "compat.h" -a "$i" != "gen-compat-autoconf.sh" ]; then

WARNING: line over 80 characters
#93: FILE: checkstuff.sh:93:
+				"${MAIL_AGGREGATOR}" "${DB}" add "checkpatch $branch $i" logfull logfull

WARNING: line over 80 characters
#109: FILE: checkstuff.sh:109:
+				"${MAIL_AGGREGATOR}" "${DB}" add "bracket_align $branch $i" logfull logfull

WARNING: line over 80 characters
#121: FILE: checkstuff.sh:121:
+	(EXTRA_CFLAGS="-Werror $extra_flags" "${MAKE}" CHECK="${SPARSE} -Wsparse-all -Wno-ptr-subtraction-blows -D__CHECK_ENDIAN__" $config CC="${CGCC}" KERNELPATH="${LINUX_HEADERS}"/"${linux_name}" 3>&2 2>&1 1>&3 \

WARNING: line over 80 characters
#123: FILE: checkstuff.sh:123:
+			|grep -v "hard-interface.c.*subtraction of functions? Share your drugs" \

WARNING: line over 80 characters
#127: FILE: checkstuff.sh:127:
+		"${MAIL_AGGREGATOR}" "${DB}" add "sparse $branch ${linux_name} ${config}" log logfull

WARNING: line over 80 characters
#142: FILE: checkstuff.sh:142:
+		"${MAIL_AGGREGATOR}" "${DB}" add "unused_symbols ${branch} ${linux_name} ${config}" log log

WARNING: line over 80 characters
#154: FILE: checkstuff.sh:154:
+		"${MAIL_AGGREGATOR}" "${DB}" add "wrong namespace symbols ${branch} ${linux_name} ${config}" log log

WARNING: line over 80 characters
#164: FILE: checkstuff.sh:164:
+	EXTRA_CFLAGS="-Werror $extra_flags" "${MAKE}" CHECK="${SMATCH} -p=kernel --two-passes --file-output" $config CC="${CGCC}" KERNELPATH="${LINUX_HEADERS}"/"${linux_name}" &> /dev/null

WARNING: line over 80 characters
#167: FILE: checkstuff.sh:167:
+	# disabled for now: filter batadv_mcast_get_bridge - Linus says this was intentional to support compat code

WARNING: line over 80 characters
#174: FILE: checkstuff.sh:174:
+		| grep -v atomic_dec_and_test.*info:\ ignoring\ unreachable\ code. \

WARNING: line over 80 characters
#175: FILE: checkstuff.sh:175:
+		| grep -v batadv_mcast_has_bridge.*info:\ ignoring\ unreachable\ code. \

WARNING: line over 80 characters
#178: FILE: checkstuff.sh:178:
+		"${MAIL_AGGREGATOR}" "${DB}" add "smatch $branch ${linux_name} $config" log log

WARNING: line over 80 characters
#187: FILE: checkstuff.sh:187:
+		git archive --remote="${REMOTE}" --format=tar --prefix="tmp/" "$branch" | tar x

WARNING: line over 80 characters
#199: FILE: checkstuff.sh:199:
+				test_sparse "${branch}" "${linux_name}" "${config}"

WARNING: line over 80 characters
#200: FILE: checkstuff.sh:200:
+				test_unused_symbols "${branch}" "${linux_name}" "${config}"

WARNING: line over 80 characters
#201: FILE: checkstuff.sh:201:
+				test_wrong_namespace "${branch}" "${linux_name}" "${config}"

WARNING: line over 80 characters
#202: FILE: checkstuff.sh:202:
+				"${MAKE}" $config KERNELPATH="${LINUX_HEADERS}"/"${linux_name}" clean

WARNING: line over 80 characters
#204: FILE: checkstuff.sh:204:
+				#test_smatch "${branch}" "${linux_name}" "${config}"

WARNING: line over 80 characters
#205: FILE: checkstuff.sh:205:
+				#"${MAKE}" $config KERNELPATH="${LINUX_HEADERS}"/"${linux_name}" clean

ERROR: trailing whitespace
#209: FILE: checkstuff.sh:209:
+^I^I^Ifor i in `seq 0 15`; do $

WARNING: line over 80 characters
#214: FILE: checkstuff.sh:214:
+				test_sparse "${branch}" "${linux_name}" "${config}"

WARNING: line over 80 characters
#215: FILE: checkstuff.sh:215:
+				test_unused_symbols "${branch}" "${linux_name}" "${config}"

WARNING: line over 80 characters
#216: FILE: checkstuff.sh:216:
+				test_wrong_namespace "${branch}" "${linux_name}" "${config}"

WARNING: line over 80 characters
#217: FILE: checkstuff.sh:217:
+				"${MAKE}" $config KERNELPATH="${LINUX_HEADERS}"/linux-3.$i clean

WARNING: line over 80 characters
#219: FILE: checkstuff.sh:219:
+				test_smatch "${branch}" "${linux_name}" "${config}"

WARNING: line over 80 characters
#220: FILE: checkstuff.sh:220:
+				"${MAKE}" $config KERNELPATH="${LINUX_HEADERS}"/"${linux_name}" clean

WARNING: line over 80 characters
#237: FILE: checkstuff.sh:237:
+"${MAIL_AGGREGATOR}" "${DB}" send "${FROM}" "${TO}" "Build check errors found: `date '+%Y-%m-%d'`"

total: 1 errors, 42 warnings, 0 checks, 237 lines checked

checkpatch next clean_sources.sh:
>>>>>>>>
WARNING: line over 80 characters
#18: FILE: clean_sources.sh:18:
+	find . -iname "*.cmd" -not -iname "auto.conf.cmd" -print0 | xargs --null rm -f

WARNING: line over 80 characters
#21: FILE: clean_sources.sh:21:
+	find arch -maxdepth 1 -type d -not -iname i386 -not -iname x86_64 -not -iname x86 -not -iname arch -print0 | xargs --null rm -rf

WARNING: line over 80 characters
#22: FILE: clean_sources.sh:22:
+	find include -maxdepth 1 -type d -iname "asm-*" -not -iname asm-i386 -not -iname asm-x86_64 -not -iname asm-x86 -not -iname asm-generic  -not -iname include -print0 | xargs --null rm -rf

WARNING: line over 80 characters
#25: FILE: clean_sources.sh:25:
+	find |grep -v '/include/'|grep -v '/arch/'|grep "\.h$"|xargs -d '\n' rm -f

total: 0 errors, 4 warnings, 0 checks, 29 lines checked

checkpatch next cppcheck:
>>>>>>>>
diff: cppcheck/null: No such file or directory

checkpatch next find_unused_symbols.sh:
>>>>>>>>
WARNING: line over 80 characters
#7: FILE: find_unused_symbols.sh:7:
+blacklist="cleanup_module batadv_hash_set_lock_class batadv_send_skb_prepare_unicast_4addr batadv_unicast_4addr_prepare_skb batadv_skb_crc32"

total: 0 errors, 1 warnings, 0 checks, 25 lines checked

checkpatch next generate_config_params.py:
>>>>>>>>
ERROR: trailing whitespace
#16: FILE: generate_config_params.py:16:
+^I$

total: 1 errors, 0 warnings, 0 checks, 30 lines checked

checkpatch next linux-build:
>>>>>>>>
diff: linux-build/null: No such file or directory

checkpatch next linux-build.img:
>>>>>>>>
ERROR: Does not appear to be a unified-diff format patch

total: 1 errors, 0 warnings, 0 checks, 0 lines checked

checkpatch next linux-next:
>>>>>>>>
diff: linux-next/null: No such file or directory

checkpatch next mail:
>>>>>>>>
CHECK: 'intialize' may be misspelled - perhaps 'initialize'?
#49: FILE: mail:49:
+CHECK: 'intialize' may be misspelled - perhaps 'initialize'?

CHECK: 'intialize' may be misspelled - perhaps 'initialize'?
#51: FILE: mail:51:
++	/* all claims gone, intialize CRC */

CHECK: 'occurence' may be misspelled - perhaps 'occurrence'?
#53: FILE: mail:53:
+CHECK: 'occurence' may be misspelled - perhaps 'occurrence'?

CHECK: 'occurence' may be misspelled - perhaps 'occurrence'?
#55: FILE: mail:55:
++	 * and allow it, its the first occurence.

CHECK: 'accomodate' may be misspelled - perhaps 'accommodate'?
#134: FILE: mail:134:
+CHECK: 'accomodate' may be misspelled - perhaps 'accommodate'?

CHECK: 'accomodate' may be misspelled - perhaps 'accommodate'?
#136: FILE: mail:136:
++ * batadv_tvlv_realloc_packet_buff - reallocate packet buffer to accomodate

CHECK: 'endianess' may be misspelled - perhaps 'endianness'?
#142: FILE: mail:142:
+CHECK: 'endianess' may be misspelled - perhaps 'endianness'?

CHECK: 'endianess' may be misspelled - perhaps 'endianness'?
#144: FILE: mail:144:
++#error "unknown bitfield endianess"

CHECK: 'boundry' may be misspelled - perhaps 'boundary'?
#146: FILE: mail:146:
+CHECK: 'boundry' may be misspelled - perhaps 'boundary'?

CHECK: 'boundry' may be misspelled - perhaps 'boundary'?
#148: FILE: mail:148:
++ * @align: 2 bytes to align the header to a 4 byte boundry

CHECK: 'choosen' may be misspelled - perhaps 'chosen'?
#154: FILE: mail:154:
+CHECK: 'choosen' may be misspelled - perhaps 'chosen'?

CHECK: 'choosen' may be misspelled - perhaps 'chosen'?
#156: FILE: mail:156:
++	 * If this can't be found either, return the previously choosen

CHECK: 'adress' may be misspelled - perhaps 'address'?
#162: FILE: mail:162:
+CHECK: 'adress' may be misspelled - perhaps 'address'?

CHECK: 'adress' may be misspelled - perhaps 'address'?
#164: FILE: mail:164:
++ * @addr: the mac adress of the client to check

CHECK: 'occured' may be misspelled - perhaps 'occurred'?
#170: FILE: mail:170:
+CHECK: 'occured' may be misspelled - perhaps 'occurred'?

CHECK: 'occured' may be misspelled - perhaps 'occurred'?
#172: FILE: mail:172:
++ * struct batadv_tt_change_node - structure for tt changes occured

CHECK: 'intialize' may be misspelled - perhaps 'initialize'?
#214: FILE: mail:214:
+CHECK: 'intialize' may be misspelled - perhaps 'initialize'?

CHECK: 'intialize' may be misspelled - perhaps 'initialize'?
#216: FILE: mail:216:
++	/* all claims gone, intialize CRC */

CHECK: 'occurence' may be misspelled - perhaps 'occurrence'?
#228: FILE: mail:228:
+CHECK: 'occurence' may be misspelled - perhaps 'occurrence'?

CHECK: 'occurence' may be misspelled - perhaps 'occurrence'?
#230: FILE: mail:230:
++	 * and allow it, its the first occurence.

CHECK: 'accomodate' may be misspelled - perhaps 'accommodate'?
#361: FILE: mail:361:
+CHECK: 'accomodate' may be misspelled - perhaps 'accommodate'?

CHECK: 'accomodate' may be misspelled - perhaps 'accommodate'?
#363: FILE: mail:363:
++ * batadv_tvlv_realloc_packet_buff - reallocate packet buffer to accomodate

CHECK: 'endianess' may be misspelled - perhaps 'endianness'?
#411: FILE: mail:411:
+CHECK: 'endianess' may be misspelled - perhaps 'endianness'?

CHECK: 'endianess' may be misspelled - perhaps 'endianness'?
#413: FILE: mail:413:
++#error "unknown bitfield endianess"

CHECK: 'boundry' may be misspelled - perhaps 'boundary'?
#415: FILE: mail:415:
+CHECK: 'boundry' may be misspelled - perhaps 'boundary'?

CHECK: 'boundry' may be misspelled - perhaps 'boundary'?
#417: FILE: mail:417:
++ * @align: 2 bytes to align the header to a 4 byte boundry

CHECK: 'choosen' may be misspelled - perhaps 'chosen'?
#428: FILE: mail:428:
+CHECK: 'choosen' may be misspelled - perhaps 'chosen'?

CHECK: 'choosen' may be misspelled - perhaps 'chosen'?
#430: FILE: mail:430:
++	 * If this can't be found either, return the previously choosen

CHECK: 'adress' may be misspelled - perhaps 'address'?
#459: FILE: mail:459:
+CHECK: 'adress' may be misspelled - perhaps 'address'?

CHECK: 'adress' may be misspelled - perhaps 'address'?
#461: FILE: mail:461:
++ * @addr: the mac adress of the client to check

CHECK: 'occured' may be misspelled - perhaps 'occurred'?
#467: FILE: mail:467:
+CHECK: 'occured' may be misspelled - perhaps 'occurred'?

CHECK: 'occured' may be misspelled - perhaps 'occurred'?
#469: FILE: mail:469:
++ * struct batadv_tt_change_node - structure for tt changes occured

total: 0 errors, 0 warnings, 32 checks, 633 lines checked

checkpatch next mail_aggregator.py:
>>>>>>>>
ERROR: trailing whitespace
#58: FILE: mail_aggregator.py:58:
+^I$

total: 1 errors, 0 warnings, 0 checks, 113 lines checked

checkpatch next make_all.sh:
>>>>>>>>
WARNING: line over 80 characters
#7: FILE: make_all.sh:7:
+	grep -v 'CONFIG_MODULES is not set' .config > .config.tmp; mv .config.tmp .config

WARNING: line over 80 characters
#8: FILE: make_all.sh:8:
+	grep -v 'CONFIG_NET is not set' .config > .config.tmp; mv .config.tmp .config

WARNING: line over 80 characters
#9: FILE: make_all.sh:9:
+	grep -v 'CONFIG_DEBUG_STRICT_USER_COPY_CHECKS is not set' .config > .config.tmp; mv .config.tmp .config

WARNING: line over 80 characters
#10: FILE: make_all.sh:10:
+	grep -v 'CONFIG_SPARSE_RCU_POINTER is not set' .config > .config.tmp; mv .config.tmp .config

WARNING: line over 80 characters
#11: FILE: make_all.sh:11:
+	grep -v 'CONFIG_ENABLE_MUST_CHECK is not set' .config > .config.tmp; mv .config.tmp .config

WARNING: line over 80 characters
#12: FILE: make_all.sh:12:
+	grep -v 'CONFIG_ENABLE_WARN_DEPRECATED is not set' .config > .config.tmp; mv .config.tmp .config

WARNING: line over 80 characters
#13: FILE: make_all.sh:13:
+	grep -v 'CONFIG_CRC16 is not set' .config > .config.tmp; mv .config.tmp .config

WARNING: line over 80 characters
#14: FILE: make_all.sh:14:
+	grep -v 'CONFIG_DEBUG_FS is not set' .config > .config.tmp; mv .config.tmp .config

WARNING: line over 80 characters
#16: FILE: make_all.sh:16:
+		grep -v 'CONFIG_SMP is not set' .config > .config.tmp; mv .config.tmp .config

WARNING: line over 80 characters
#17: FILE: make_all.sh:17:
+		grep -v 'CONFIG_MODULE_UNLOAD is not set' .config > .config.tmp; mv .config.tmp .config

WARNING: line over 80 characters
#29: FILE: make_all.sh:29:
+	if [ "$1" = "2.6" -a \( "$2" = "29" -o "$2" = "30" -o "$2" = "31" -o "$2" = "32" -o "$2" = "33" -o "$2" = "34" -o "$2" = "35" \) ]; then

WARNING: line over 80 characters
#39: FILE: make_all.sh:39:
+	#wget "http://www.kernel.org/pub/linux/kernel/v2.6/linux-2.6.${i}.tar.gz"

WARNING: line over 80 characters
#42: FILE: make_all.sh:42:
+	git archive --remote=git+ssh://git@git.open-mesh.org/linux-merge.git --format tar --prefix=linux-2.6.${i}/ v2.6.${i}|tar x

WARNING: line over 80 characters
#45: FILE: make_all.sh:45:
+		if [ "$i" = 29 -o "$i" = 30 -o "$i" = 31 -o "$i" = 32 -o "$i" = 33 -o "$i" = 34 -o "$i" = 35 -o "$i" = 36 ]; then

WARNING: line over 80 characters
#46: FILE: make_all.sh:46:
+			sed -i 's/^\(KBUILD_CFLAGS[[:space:]]*:=\)[[:space:]]*\(-Wall\)/\1 -Wno-unused-but-set-variable \2/' Makefile

WARNING: line over 80 characters
#64: FILE: make_all.sh:64:
+	git archive --remote=git+ssh://git@git.open-mesh.org/linux-merge.git --format tar --prefix=linux-3.${i}/ v3.${i}|tar x

total: 0 errors, 16 warnings, 0 checks, 84 lines checked

checkpatch next minilinux:
>>>>>>>>
diff: minilinux/null: No such file or directory

checkpatch next patches:
>>>>>>>>
diff: patches/null: No such file or directory

checkpatch next smatch:
>>>>>>>>
diff: smatch/null: No such file or directory

checkpatch next sparse:
>>>>>>>>
diff: sparse/null: No such file or directory

sparse master linux-3.15 CONFIG_BATMAN_ADV_BLA=y CONFIG_BATMAN_ADV_DAT=n CONFIG_BATMAN_ADV_DEBUG=y CONFIG_BATMAN_ADV_NC=n CONFIG_BATMAN_ADV_MCAST=n:
>>>>>>>>
include/linux/rculist.h:402:9: warning: Variable length array is used.
include/linux/rculist.h:402:9: error: cannot size expression
include/linux/rculist.h:402:9: warning: Variable length array is used.
include/linux/rculist.h:402:9: error: cannot size expression
/home/batman/build_test/tmp/gateway_client.c:106:9: warning: Variable length array is used.
/home/batman/build_test/tmp/gateway_client.c:106:9: error: cannot size expression
include/linux/rculist.h:402:9: error: cannot size expression
/home/batman/build_test/tmp/hard-interface.c:194:9: warning: Variable length array is used.
/home/batman/build_test/tmp/hard-interface.c:194:9: error: cannot size expression
include/linux/rculist.h:54:9: error: cannot size expression
include/linux/rculist.h:402:9: warning: Variable length array is used.
include/linux/rculist.h:402:9: error: cannot size expression
include/linux/rculist.h:54:9: warning: Variable length array is used.
include/linux/rculist.h:54:9: error: cannot size expression
include/linux/rculist.h:402:9: error: cannot size expression
/home/batman/build_test/tmp/routing.c:91:9: warning: Variable length array is used.
/home/batman/build_test/tmp/routing.c:91:9: error: cannot size expression
include/linux/rculist.h:402:9: warning: Variable length array is used.
include/linux/rculist.h:402:9: error: cannot size expression
include/linux/rculist.h:402:9: warning: Variable length array is used.
include/linux/rculist.h:402:9: error: cannot size expression

sparse master linux-3.15 CONFIG_BATMAN_ADV_BLA=y CONFIG_BATMAN_ADV_DAT=n CONFIG_BATMAN_ADV_DEBUG=y CONFIG_BATMAN_ADV_NC=n CONFIG_BATMAN_ADV_MCAST=y:
>>>>>>>>
include/linux/rculist.h:402:9: warning: Variable length array is used.
include/linux/rculist.h:402:9: error: cannot size expression
include/linux/rculist.h:402:9: warning: Variable length array is used.
include/linux/rculist.h:402:9: error: cannot size expression
/home/batman/build_test/tmp/gateway_client.c:106:9: warning: Variable length array is used.
/home/batman/build_test/tmp/gateway_client.c:106:9: error: cannot size expression
include/linux/rculist.h:402:9: error: cannot size expression
/home/batman/build_test/tmp/hard-interface.c:194:9: warning: Variable length array is used.
/home/batman/build_test/tmp/hard-interface.c:194:9: error: cannot size expression
include/linux/rculist.h:54:9: error: cannot size expression
include/linux/rculist.h:402:9: warning: Variable length array is used.
include/linux/rculist.h:402:9: error: cannot size expression
include/linux/rculist.h:54:9: warning: Variable length array is used.
include/linux/rculist.h:54:9: error: cannot size expression
include/linux/rculist.h:402:9: error: cannot size expression
/home/batman/build_test/tmp/routing.c:91:9: warning: Variable length array is used.
/home/batman/build_test/tmp/routing.c:91:9: error: cannot size expression
include/linux/rculist.h:402:9: warning: Variable length array is used.
include/linux/rculist.h:402:9: error: cannot size expression
include/linux/rculist.h:402:9: warning: Variable length array is used.
include/linux/rculist.h:402:9: error: cannot size expression
include/linux/rculist.h:402:9: warning: Variable length array is used.
include/linux/rculist.h:402:9: error: cannot size expression

sparse master linux-3.15 CONFIG_BATMAN_ADV_BLA=y CONFIG_BATMAN_ADV_DAT=y CONFIG_BATMAN_ADV_DEBUG=n CONFIG_BATMAN_ADV_NC=y CONFIG_BATMAN_ADV_MCAST=n:
>>>>>>>>
include/linux/rculist.h:402:9: warning: Variable length array is used.
include/linux/rculist.h:402:9: error: cannot size expression
include/linux/rculist.h:402:9: warning: Variable length array is used.
include/linux/rculist.h:402:9: error: cannot size expression
include/linux/rculist.h:402:9: warning: Variable length array is used.
include/linux/rculist.h:402:9: error: cannot size expression
/home/batman/build_test/tmp/gateway_client.c:106:9: warning: Variable length array is used.
/home/batman/build_test/tmp/gateway_client.c:106:9: error: cannot size expression
include/linux/rculist.h:402:9: error: cannot size expression
/home/batman/build_test/tmp/hard-interface.c:194:9: warning: Variable length array is used.
/home/batman/build_test/tmp/hard-interface.c:194:9: error: cannot size expression
include/linux/rculist.h:54:9: error: cannot size expression
include/linux/rculist.h:402:9: warning: Variable length array is used.
include/linux/rculist.h:402:9: error: cannot size expression
include/linux/rculist.h:54:9: warning: Variable length array is used.
include/linux/rculist.h:54:9: error: cannot size expression
include/linux/rculist.h:402:9: error: cannot size expression
include/linux/rculist.h:54:9: warning: Variable length array is used.
include/linux/rculist.h:54:9: error: cannot size expression
include/linux/rculist.h:402:9: error: cannot size expression
/home/batman/build_test/tmp/routing.c:91:9: warning: Variable length array is used.
/home/batman/build_test/tmp/routing.c:91:9: error: cannot size expression
include/linux/rculist.h:402:9: warning: Variable length array is used.
include/linux/rculist.h:402:9: error: cannot size expression
include/linux/rculist.h:402:9: warning: Variable length array is used.
include/linux/rculist.h:402:9: error: cannot size expression

sparse master linux-3.15 CONFIG_BATMAN_ADV_BLA=y CONFIG_BATMAN_ADV_DAT=y CONFIG_BATMAN_ADV_DEBUG=y CONFIG_BATMAN_ADV_NC=y CONFIG_BATMAN_ADV_MCAST=y:
>>>>>>>>
include/linux/rculist.h:402:9: warning: Variable length array is used.
include/linux/rculist.h:402:9: error: cannot size expression
include/linux/rculist.h:402:9: warning: Variable length array is used.
include/linux/rculist.h:402:9: error: cannot size expression
include/linux/rculist.h:402:9: warning: Variable length array is used.
include/linux/rculist.h:402:9: error: cannot size expression
/home/batman/build_test/tmp/gateway_client.c:106:9: warning: Variable length array is used.
/home/batman/build_test/tmp/gateway_client.c:106:9: error: cannot size expression
include/linux/rculist.h:402:9: error: cannot size expression
/home/batman/build_test/tmp/hard-interface.c:194:9: warning: Variable length array is used.
/home/batman/build_test/tmp/hard-interface.c:194:9: error: cannot size expression
include/linux/rculist.h:54:9: error: cannot size expression
include/linux/rculist.h:402:9: warning: Variable length array is used.
include/linux/rculist.h:402:9: error: cannot size expression
include/linux/rculist.h:54:9: warning: Variable length array is used.
include/linux/rculist.h:54:9: error: cannot size expression
include/linux/rculist.h:402:9: error: cannot size expression
include/linux/rculist.h:54:9: warning: Variable length array is used.
include/linux/rculist.h:54:9: error: cannot size expression
include/linux/rculist.h:402:9: error: cannot size expression
/home/batman/build_test/tmp/routing.c:91:9: warning: Variable length array is used.
/home/batman/build_test/tmp/routing.c:91:9: error: cannot size expression
include/linux/rculist.h:402:9: warning: Variable length array is used.
include/linux/rculist.h:402:9: error: cannot size expression
include/linux/rculist.h:402:9: warning: Variable length array is used.
include/linux/rculist.h:402:9: error: cannot size expression
include/linux/rculist.h:402:9: warning: Variable length array is used.
include/linux/rculist.h:402:9: error: cannot size expression

sparse next linux-3.15 CONFIG_BATMAN_ADV_BLA=n CONFIG_BATMAN_ADV_DAT=y CONFIG_BATMAN_ADV_DEBUG=n CONFIG_BATMAN_ADV_NC=y CONFIG_BATMAN_ADV_MCAST=n:
>>>>>>>>
make: *** No targets specified and no makefile found.  Stop.

wrong namespace symbols next linux-3.15 CONFIG_BATMAN_ADV_BLA=n CONFIG_BATMAN_ADV_DAT=y CONFIG_BATMAN_ADV_DEBUG=n CONFIG_BATMAN_ADV_NC=y CONFIG_BATMAN_ADV_MCAST=n:
>>>>>>>>
nm: '*.o': No such file



More information about the linux-merge mailing list