Build check errors found: 2013-05-07

postmaster at open-mesh.org postmaster at open-mesh.org
Tue May 7 01:01:08 CEST 2013


Name of failed tests
====================

checkpatch master bridge_loop_avoidance.c
checkpatch master gateway_client.c
checkpatch master main.c
checkpatch master translation-table.c
checkpatch next bridge_loop_avoidance.c
checkpatch next gateway_client.c
checkpatch next main.c
checkpatch next translation-table.c
sparse master linux-3.9 CONFIG_BATMAN_ADV_BLA=n CONFIG_BATMAN_ADV_DAT=n CONFIG_BATMAN_ADV_DEBUG=n CONFIG_BATMAN_ADV_NC=n
sparse master linux-3.9 CONFIG_BATMAN_ADV_BLA=n CONFIG_BATMAN_ADV_DAT=y CONFIG_BATMAN_ADV_DEBUG=n CONFIG_BATMAN_ADV_NC=y
sparse master linux-3.9 CONFIG_BATMAN_ADV_BLA=y CONFIG_BATMAN_ADV_DAT=y CONFIG_BATMAN_ADV_DEBUG=y CONFIG_BATMAN_ADV_NC=n
sparse master linux-3.9 CONFIG_BATMAN_ADV_BLA=y CONFIG_BATMAN_ADV_DAT=y CONFIG_BATMAN_ADV_DEBUG=y CONFIG_BATMAN_ADV_NC=y
sparse next linux-3.9 CONFIG_BATMAN_ADV_BLA=y CONFIG_BATMAN_ADV_DAT=n CONFIG_BATMAN_ADV_DEBUG=n CONFIG_BATMAN_ADV_NC=n
sparse next linux-3.9 CONFIG_BATMAN_ADV_BLA=y CONFIG_BATMAN_ADV_DAT=y CONFIG_BATMAN_ADV_DEBUG=n CONFIG_BATMAN_ADV_NC=n

Output of different failed tests
================================

checkpatch master gateway_client.c:
>>>>>>>>
WARNING: Prefer seq_puts to seq_printf
#535: FILE: gateway_client.c:535:
+	seq_printf(seq,

total: 0 errors, 1 warnings, 0 checks, 767 lines checked

checkpatch master main.c:
>>>>>>>>
WARNING: Prefer seq_puts to seq_printf
#228: FILE: main.c:228:
+		seq_printf(seq,

WARNING: Prefer seq_puts to seq_printf
#237: FILE: main.c:237:
+	seq_printf(seq,

total: 0 errors, 2 warnings, 0 checks, 1141 lines checked

checkpatch master translation-table.c:
>>>>>>>>
WARNING: Prefer seq_puts to seq_printf
#483: FILE: translation-table.c:483:
+	seq_printf(seq,

WARNING: Prefer seq_puts to seq_printf
#997: FILE: translation-table.c:997:
+		seq_printf(seq,

WARNING: Prefer seq_puts to seq_printf
#1039: FILE: translation-table.c:1039:
+	seq_printf(seq,

total: 0 errors, 3 warnings, 0 checks, 2747 lines checked

checkpatch next bridge_loop_avoidance.c:
>>>>>>>>
WARNING: Prefer seq_puts to seq_printf
#1621: FILE: bridge_loop_avoidance.c:1621:
+	seq_printf(seq,

WARNING: Prefer seq_puts to seq_printf
#1666: FILE: bridge_loop_avoidance.c:1666:
+	seq_printf(seq,

total: 0 errors, 2 warnings, 0 checks, 1698 lines checked

checkpatch next gateway_client.c:
>>>>>>>>
WARNING: Prefer seq_puts to seq_printf
#483: FILE: gateway_client.c:483:
+	seq_printf(seq,

total: 0 errors, 1 warnings, 0 checks, 712 lines checked

checkpatch next main.c:
>>>>>>>>
WARNING: Prefer seq_puts to seq_printf
#225: FILE: main.c:225:
+		seq_printf(seq,

WARNING: Prefer seq_puts to seq_printf
#234: FILE: main.c:234:
+	seq_printf(seq,

total: 0 errors, 2 warnings, 0 checks, 511 lines checked

checkpatch next translation-table.c:
>>>>>>>>
WARNING: Prefer seq_puts to seq_printf
#491: FILE: translation-table.c:491:
+	seq_printf(seq,

WARNING: Prefer seq_puts to seq_printf
#1003: FILE: translation-table.c:1003:
+		seq_printf(seq,

WARNING: Prefer seq_puts to seq_printf
#1045: FILE: translation-table.c:1045:
+	seq_printf(seq,

total: 0 errors, 3 warnings, 0 checks, 2602 lines checked

sparse master linux-3.9 CONFIG_BATMAN_ADV_BLA=n CONFIG_BATMAN_ADV_DAT=n CONFIG_BATMAN_ADV_DEBUG=n CONFIG_BATMAN_ADV_NC=n:
>>>>>>>>
No such file: c
No such file: c
include/uapi/linux/swab.h:60:16: error: undefined identifier '__builtin_bswap32'
include/uapi/linux/swab.h:60:33: error: not a function <noident>
include/uapi/linux/swab.h:60:33: error: not a function <noident>
include/uapi/linux/swab.h:60:33: error: not a function <noident>
include/uapi/linux/swab.h:60:33: error: not a function <noident>
include/uapi/linux/swab.h:60:33: error: not a function <noident>
include/uapi/linux/swab.h:60:33: error: not a function <noident>
include/uapi/linux/swab.h:60:16: error: undefined identifier '__builtin_bswap32'
include/uapi/linux/swab.h:60:33: error: not a function <noident>
include/uapi/linux/swab.h:60:33: error: not a function <noident>
include/uapi/linux/swab.h:60:33: error: not a function <noident>
include/uapi/linux/swab.h:60:33: error: not a function <noident>
include/uapi/linux/swab.h:60:33: error: not a function <noident>
include/uapi/linux/swab.h:60:33: error: not a function <noident>
include/uapi/linux/swab.h:60:33: error: not a function <noident>
include/uapi/linux/swab.h:60:33: error: not a function <noident>
include/uapi/linux/swab.h:60:33: error: not a function <noident>
include/uapi/linux/swab.h:60:33: error: not a function <noident>
include/uapi/linux/swab.h:60:33: error: not a function <noident>
include/uapi/linux/swab.h:60:33: error: not a function <noident>
include/uapi/linux/swab.h:60:16: error: undefined identifier '__builtin_bswap32'
include/uapi/linux/swab.h:60:33: error: not a function <noident>
include/uapi/linux/swab.h:60:16: error: undefined identifier '__builtin_bswap32'
include/uapi/linux/swab.h:60:16: error: undefined identifier '__builtin_bswap32'
include/uapi/linux/swab.h:60:33: error: not a function <noident>
include/uapi/linux/swab.h:60:33: error: not a function <noident>
include/uapi/linux/swab.h:60:16: error: undefined identifier '__builtin_bswap32'
include/uapi/linux/swab.h:60:16: error: undefined identifier '__builtin_bswap32'
include/uapi/linux/swab.h:60:33: error: not a function <noident>
include/uapi/linux/swab.h:60:33: error: not a function <noident>
include/uapi/linux/swab.h:60:33: error: not a function <noident>

sparse master linux-3.9 CONFIG_BATMAN_ADV_BLA=y CONFIG_BATMAN_ADV_DAT=y CONFIG_BATMAN_ADV_DEBUG=y CONFIG_BATMAN_ADV_NC=n:
>>>>>>>>
No such file: c
No such file: c
include/uapi/linux/swab.h:60:16: error: undefined identifier '__builtin_bswap32'
include/uapi/linux/swab.h:60:33: error: not a function <noident>
include/uapi/linux/swab.h:60:33: error: not a function <noident>
include/uapi/linux/swab.h:60:33: error: not a function <noident>
include/uapi/linux/swab.h:60:33: error: not a function <noident>
include/uapi/linux/swab.h:60:33: error: not a function <noident>
include/uapi/linux/swab.h:60:33: error: not a function <noident>
include/uapi/linux/swab.h:60:16: error: undefined identifier '__builtin_bswap32'
include/uapi/linux/swab.h:60:33: error: not a function <noident>
include/uapi/linux/swab.h:60:33: error: not a function <noident>
include/uapi/linux/swab.h:60:33: error: not a function <noident>
include/uapi/linux/swab.h:60:33: error: not a function <noident>
include/uapi/linux/swab.h:60:33: error: not a function <noident>
include/uapi/linux/swab.h:60:33: error: not a function <noident>
include/uapi/linux/swab.h:60:33: error: not a function <noident>
include/uapi/linux/swab.h:60:33: error: not a function <noident>
include/uapi/linux/swab.h:60:33: error: not a function <noident>
include/uapi/linux/swab.h:60:33: error: not a function <noident>
include/uapi/linux/swab.h:60:33: error: not a function <noident>
include/uapi/linux/swab.h:60:33: error: not a function <noident>
include/uapi/linux/swab.h:60:33: error: not a function <noident>
include/uapi/linux/swab.h:60:16: error: undefined identifier '__builtin_bswap32'
include/uapi/linux/swab.h:60:33: error: not a function <noident>
include/uapi/linux/swab.h:60:33: error: not a function <noident>
include/uapi/linux/swab.h:60:33: error: not a function <noident>
include/uapi/linux/swab.h:60:33: error: not a function <noident>
include/uapi/linux/swab.h:60:33: error: not a function <noident>
include/uapi/linux/swab.h:60:33: error: not a function <noident>
include/uapi/linux/swab.h:60:33: error: not a function <noident>
include/uapi/linux/swab.h:60:33: error: not a function <noident>
include/uapi/linux/swab.h:60:33: error: not a function <noident>
include/uapi/linux/swab.h:60:33: error: not a function <noident>
include/uapi/linux/swab.h:60:33: error: not a function <noident>
include/uapi/linux/swab.h:60:33: error: not a function <noident>
include/uapi/linux/swab.h:60:16: error: undefined identifier '__builtin_bswap32'
include/uapi/linux/swab.h:60:33: error: not a function <noident>
include/uapi/linux/swab.h:60:16: error: undefined identifier '__builtin_bswap32'
include/uapi/linux/swab.h:60:16: error: undefined identifier '__builtin_bswap32'
include/uapi/linux/swab.h:60:33: error: not a function <noident>
include/uapi/linux/swab.h:60:33: error: not a function <noident>
include/uapi/linux/swab.h:60:16: error: undefined identifier '__builtin_bswap32'
include/uapi/linux/swab.h:60:16: error: undefined identifier '__builtin_bswap32'
include/uapi/linux/swab.h:60:33: error: not a function <noident>
include/uapi/linux/swab.h:60:33: error: not a function <noident>
include/uapi/linux/swab.h:60:33: error: not a function <noident>

sparse master linux-3.9 CONFIG_BATMAN_ADV_BLA=y CONFIG_BATMAN_ADV_DAT=y CONFIG_BATMAN_ADV_DEBUG=y CONFIG_BATMAN_ADV_NC=y:
>>>>>>>>
No such file: c
No such file: c
include/uapi/linux/swab.h:60:16: error: undefined identifier '__builtin_bswap32'
include/uapi/linux/swab.h:60:33: error: not a function <noident>
include/uapi/linux/swab.h:60:33: error: not a function <noident>
include/uapi/linux/swab.h:60:33: error: not a function <noident>
include/uapi/linux/swab.h:60:33: error: not a function <noident>
include/uapi/linux/swab.h:60:33: error: not a function <noident>
include/uapi/linux/swab.h:60:33: error: not a function <noident>
include/uapi/linux/swab.h:60:16: error: undefined identifier '__builtin_bswap32'
include/uapi/linux/swab.h:60:33: error: not a function <noident>
include/uapi/linux/swab.h:60:33: error: not a function <noident>
include/uapi/linux/swab.h:60:33: error: not a function <noident>
include/uapi/linux/swab.h:60:33: error: not a function <noident>
include/uapi/linux/swab.h:60:33: error: not a function <noident>
include/uapi/linux/swab.h:60:33: error: not a function <noident>
include/uapi/linux/swab.h:60:33: error: not a function <noident>
include/uapi/linux/swab.h:60:33: error: not a function <noident>
include/uapi/linux/swab.h:60:33: error: not a function <noident>
include/uapi/linux/swab.h:60:33: error: not a function <noident>
include/uapi/linux/swab.h:60:33: error: not a function <noident>
include/uapi/linux/swab.h:60:33: error: not a function <noident>
include/uapi/linux/swab.h:60:33: error: not a function <noident>
include/uapi/linux/swab.h:60:16: error: undefined identifier '__builtin_bswap32'
include/uapi/linux/swab.h:60:33: error: not a function <noident>
include/uapi/linux/swab.h:60:33: error: not a function <noident>
include/uapi/linux/swab.h:60:33: error: not a function <noident>
include/uapi/linux/swab.h:60:33: error: not a function <noident>
include/uapi/linux/swab.h:60:33: error: not a function <noident>
include/uapi/linux/swab.h:60:33: error: not a function <noident>
include/uapi/linux/swab.h:60:33: error: not a function <noident>
include/uapi/linux/swab.h:60:33: error: not a function <noident>
include/uapi/linux/swab.h:60:33: error: not a function <noident>
include/uapi/linux/swab.h:60:33: error: not a function <noident>
include/uapi/linux/swab.h:60:33: error: not a function <noident>
include/uapi/linux/swab.h:60:33: error: not a function <noident>
include/uapi/linux/swab.h:60:16: error: undefined identifier '__builtin_bswap32'
include/uapi/linux/swab.h:60:33: error: not a function <noident>
include/uapi/linux/swab.h:60:16: error: undefined identifier '__builtin_bswap32'
include/uapi/linux/swab.h:60:16: error: undefined identifier '__builtin_bswap32'
include/uapi/linux/swab.h:60:16: error: undefined identifier '__builtin_bswap32'
include/uapi/linux/swab.h:60:33: error: not a function <noident>
include/uapi/linux/swab.h:60:33: error: not a function <noident>
include/uapi/linux/swab.h:60:16: error: undefined identifier '__builtin_bswap32'
include/uapi/linux/swab.h:60:16: error: undefined identifier '__builtin_bswap32'
include/uapi/linux/swab.h:60:33: error: not a function <noident>
include/uapi/linux/swab.h:60:33: error: not a function <noident>
include/uapi/linux/swab.h:60:33: error: not a function <noident>

sparse next linux-3.9 CONFIG_BATMAN_ADV_BLA=y CONFIG_BATMAN_ADV_DAT=n CONFIG_BATMAN_ADV_DEBUG=n CONFIG_BATMAN_ADV_NC=n:
>>>>>>>>
No such file: c
No such file: c
include/uapi/linux/swab.h:60:16: error: undefined identifier '__builtin_bswap32'
include/uapi/linux/swab.h:60:33: error: not a function <noident>
include/uapi/linux/swab.h:60:33: error: not a function <noident>
include/uapi/linux/swab.h:60:33: error: not a function <noident>
include/uapi/linux/swab.h:60:33: error: not a function <noident>
include/uapi/linux/swab.h:60:33: error: not a function <noident>
include/uapi/linux/swab.h:60:33: error: not a function <noident>
include/uapi/linux/swab.h:60:16: error: undefined identifier '__builtin_bswap32'
include/uapi/linux/swab.h:60:16: error: undefined identifier '__builtin_bswap32'
include/uapi/linux/swab.h:60:33: error: not a function <noident>
include/uapi/linux/swab.h:60:33: error: not a function <noident>
include/uapi/linux/swab.h:60:16: error: undefined identifier '__builtin_bswap32'
include/uapi/linux/swab.h:60:16: error: undefined identifier '__builtin_bswap32'
include/uapi/linux/swab.h:60:33: error: not a function <noident>
include/uapi/linux/swab.h:60:33: error: not a function <noident>
include/uapi/linux/swab.h:60:33: error: not a function <noident>
include/uapi/linux/swab.h:60:33: error: not a function <noident>
include/uapi/linux/swab.h:60:33: error: not a function <noident>
include/uapi/linux/swab.h:60:33: error: not a function <noident>
include/uapi/linux/swab.h:60:33: error: not a function <noident>
include/uapi/linux/swab.h:60:33: error: not a function <noident>
include/uapi/linux/swab.h:60:33: error: not a function <noident>
include/uapi/linux/swab.h:60:33: error: not a function <noident>
include/uapi/linux/swab.h:60:33: error: not a function <noident>

sparse next linux-3.9 CONFIG_BATMAN_ADV_BLA=y CONFIG_BATMAN_ADV_DAT=y CONFIG_BATMAN_ADV_DEBUG=n CONFIG_BATMAN_ADV_NC=n:
>>>>>>>>
No such file: c
No such file: c
include/uapi/linux/swab.h:60:16: error: undefined identifier '__builtin_bswap32'
include/uapi/linux/swab.h:60:33: error: not a function <noident>
include/uapi/linux/swab.h:60:33: error: not a function <noident>
include/uapi/linux/swab.h:60:33: error: not a function <noident>
include/uapi/linux/swab.h:60:33: error: not a function <noident>
include/uapi/linux/swab.h:60:33: error: not a function <noident>
include/uapi/linux/swab.h:60:33: error: not a function <noident>
include/uapi/linux/swab.h:60:16: error: undefined identifier '__builtin_bswap32'
include/uapi/linux/swab.h:60:33: error: not a function <noident>
include/uapi/linux/swab.h:60:33: error: not a function <noident>
include/uapi/linux/swab.h:60:33: error: not a function <noident>
include/uapi/linux/swab.h:60:33: error: not a function <noident>
include/uapi/linux/swab.h:60:33: error: not a function <noident>
include/uapi/linux/swab.h:60:33: error: not a function <noident>
include/uapi/linux/swab.h:60:33: error: not a function <noident>
include/uapi/linux/swab.h:60:33: error: not a function <noident>
include/uapi/linux/swab.h:60:33: error: not a function <noident>
include/uapi/linux/swab.h:60:33: error: not a function <noident>
include/uapi/linux/swab.h:60:33: error: not a function <noident>
include/uapi/linux/swab.h:60:33: error: not a function <noident>
include/uapi/linux/swab.h:60:33: error: not a function <noident>
include/uapi/linux/swab.h:60:16: error: undefined identifier '__builtin_bswap32'
include/uapi/linux/swab.h:60:16: error: undefined identifier '__builtin_bswap32'
include/uapi/linux/swab.h:60:33: error: not a function <noident>
include/uapi/linux/swab.h:60:33: error: not a function <noident>
include/uapi/linux/swab.h:60:16: error: undefined identifier '__builtin_bswap32'
include/uapi/linux/swab.h:60:16: error: undefined identifier '__builtin_bswap32'
include/uapi/linux/swab.h:60:33: error: not a function <noident>
include/uapi/linux/swab.h:60:33: error: not a function <noident>
include/uapi/linux/swab.h:60:33: error: not a function <noident>
include/uapi/linux/swab.h:60:33: error: not a function <noident>
include/uapi/linux/swab.h:60:33: error: not a function <noident>
include/uapi/linux/swab.h:60:33: error: not a function <noident>
include/uapi/linux/swab.h:60:33: error: not a function <noident>
include/uapi/linux/swab.h:60:33: error: not a function <noident>
include/uapi/linux/swab.h:60:33: error: not a function <noident>
include/uapi/linux/swab.h:60:33: error: not a function <noident>
include/uapi/linux/swab.h:60:33: error: not a function <noident>



More information about the linux-merge mailing list