Build check errors found: 2013-03-26

postmaster at open-mesh.org postmaster at open-mesh.org
Tue Mar 26 01:06:48 CET 2013


Name of failed tests
====================

checkpatch master bridge_loop_avoidance.c
checkpatch master gateway_client.c
checkpatch master main.c
checkpatch master translation-table.c
checkpatch next bridge_loop_avoidance.c
checkpatch next gateway_client.c
checkpatch next main.c
checkpatch next translation-table.c
cppcheck master
cppcheck next
sparse master linux-2.6.29 CONFIG_BATMAN_ADV_BLA=n CONFIG_BATMAN_ADV_DAT=n CONFIG_BATMAN_ADV_DEBUG=n CONFIG_BATMAN_ADV_NC=y
sparse master linux-2.6.29 CONFIG_BATMAN_ADV_BLA=n CONFIG_BATMAN_ADV_DAT=n CONFIG_BATMAN_ADV_DEBUG=y CONFIG_BATMAN_ADV_NC=n
sparse master linux-2.6.29 CONFIG_BATMAN_ADV_BLA=y CONFIG_BATMAN_ADV_DAT=n CONFIG_BATMAN_ADV_DEBUG=y CONFIG_BATMAN_ADV_NC=y
sparse master linux-2.6.30 CONFIG_BATMAN_ADV_BLA=n CONFIG_BATMAN_ADV_DAT=n CONFIG_BATMAN_ADV_DEBUG=n CONFIG_BATMAN_ADV_NC=y
sparse master linux-2.6.30 CONFIG_BATMAN_ADV_BLA=n CONFIG_BATMAN_ADV_DAT=n CONFIG_BATMAN_ADV_DEBUG=y CONFIG_BATMAN_ADV_NC=n
sparse master linux-2.6.30 CONFIG_BATMAN_ADV_BLA=y CONFIG_BATMAN_ADV_DAT=n CONFIG_BATMAN_ADV_DEBUG=y CONFIG_BATMAN_ADV_NC=y
sparse master linux-2.6.31 CONFIG_BATMAN_ADV_BLA=n CONFIG_BATMAN_ADV_DAT=n CONFIG_BATMAN_ADV_DEBUG=n CONFIG_BATMAN_ADV_NC=y
sparse master linux-2.6.31 CONFIG_BATMAN_ADV_BLA=n CONFIG_BATMAN_ADV_DAT=n CONFIG_BATMAN_ADV_DEBUG=y CONFIG_BATMAN_ADV_NC=n
sparse master linux-2.6.31 CONFIG_BATMAN_ADV_BLA=y CONFIG_BATMAN_ADV_DAT=n CONFIG_BATMAN_ADV_DEBUG=y CONFIG_BATMAN_ADV_NC=y
sparse master linux-2.6.32 CONFIG_BATMAN_ADV_BLA=n CONFIG_BATMAN_ADV_DAT=n CONFIG_BATMAN_ADV_DEBUG=n CONFIG_BATMAN_ADV_NC=y
sparse master linux-2.6.32 CONFIG_BATMAN_ADV_BLA=n CONFIG_BATMAN_ADV_DAT=n CONFIG_BATMAN_ADV_DEBUG=y CONFIG_BATMAN_ADV_NC=n
sparse master linux-2.6.32 CONFIG_BATMAN_ADV_BLA=y CONFIG_BATMAN_ADV_DAT=n CONFIG_BATMAN_ADV_DEBUG=y CONFIG_BATMAN_ADV_NC=y
sparse master linux-2.6.34 CONFIG_BATMAN_ADV_BLA=n CONFIG_BATMAN_ADV_DAT=n CONFIG_BATMAN_ADV_DEBUG=n CONFIG_BATMAN_ADV_NC=y
sparse master linux-2.6.34 CONFIG_BATMAN_ADV_BLA=n CONFIG_BATMAN_ADV_DAT=n CONFIG_BATMAN_ADV_DEBUG=y CONFIG_BATMAN_ADV_NC=n
sparse master linux-2.6.34 CONFIG_BATMAN_ADV_BLA=y CONFIG_BATMAN_ADV_DAT=n CONFIG_BATMAN_ADV_DEBUG=y CONFIG_BATMAN_ADV_NC=y
sparse master linux-2.6.35 CONFIG_BATMAN_ADV_BLA=n CONFIG_BATMAN_ADV_DAT=n CONFIG_BATMAN_ADV_DEBUG=n CONFIG_BATMAN_ADV_NC=y
sparse master linux-2.6.35 CONFIG_BATMAN_ADV_BLA=n CONFIG_BATMAN_ADV_DAT=n CONFIG_BATMAN_ADV_DEBUG=y CONFIG_BATMAN_ADV_NC=n
sparse master linux-2.6.35 CONFIG_BATMAN_ADV_BLA=y CONFIG_BATMAN_ADV_DAT=n CONFIG_BATMAN_ADV_DEBUG=y CONFIG_BATMAN_ADV_NC=y
sparse master linux-2.6.36 CONFIG_BATMAN_ADV_BLA=n CONFIG_BATMAN_ADV_DAT=n CONFIG_BATMAN_ADV_DEBUG=n CONFIG_BATMAN_ADV_NC=y
sparse master linux-2.6.36 CONFIG_BATMAN_ADV_BLA=n CONFIG_BATMAN_ADV_DAT=n CONFIG_BATMAN_ADV_DEBUG=y CONFIG_BATMAN_ADV_NC=n
sparse master linux-2.6.36 CONFIG_BATMAN_ADV_BLA=y CONFIG_BATMAN_ADV_DAT=n CONFIG_BATMAN_ADV_DEBUG=y CONFIG_BATMAN_ADV_NC=y
sparse master linux-2.6.37 CONFIG_BATMAN_ADV_BLA=n CONFIG_BATMAN_ADV_DAT=n CONFIG_BATMAN_ADV_DEBUG=n CONFIG_BATMAN_ADV_NC=y
sparse master linux-2.6.37 CONFIG_BATMAN_ADV_BLA=n CONFIG_BATMAN_ADV_DAT=n CONFIG_BATMAN_ADV_DEBUG=y CONFIG_BATMAN_ADV_NC=n
sparse master linux-2.6.37 CONFIG_BATMAN_ADV_BLA=y CONFIG_BATMAN_ADV_DAT=n CONFIG_BATMAN_ADV_DEBUG=y CONFIG_BATMAN_ADV_NC=y
sparse master linux-2.6.38 CONFIG_BATMAN_ADV_BLA=n CONFIG_BATMAN_ADV_DAT=n CONFIG_BATMAN_ADV_DEBUG=n CONFIG_BATMAN_ADV_NC=y
sparse master linux-2.6.38 CONFIG_BATMAN_ADV_BLA=n CONFIG_BATMAN_ADV_DAT=n CONFIG_BATMAN_ADV_DEBUG=y CONFIG_BATMAN_ADV_NC=n
sparse master linux-2.6.38 CONFIG_BATMAN_ADV_BLA=y CONFIG_BATMAN_ADV_DAT=n CONFIG_BATMAN_ADV_DEBUG=y CONFIG_BATMAN_ADV_NC=y
sparse next linux-2.6.29 CONFIG_BATMAN_ADV_BLA=n CONFIG_BATMAN_ADV_DAT=n CONFIG_BATMAN_ADV_DEBUG=y CONFIG_BATMAN_ADV_NC=n
sparse next linux-2.6.29 CONFIG_BATMAN_ADV_BLA=n CONFIG_BATMAN_ADV_DAT=y CONFIG_BATMAN_ADV_DEBUG=n CONFIG_BATMAN_ADV_NC=n
sparse next linux-2.6.29 CONFIG_BATMAN_ADV_BLA=n CONFIG_BATMAN_ADV_DAT=y CONFIG_BATMAN_ADV_DEBUG=y CONFIG_BATMAN_ADV_NC=n
sparse next linux-2.6.29 CONFIG_BATMAN_ADV_BLA=y CONFIG_BATMAN_ADV_DAT=y CONFIG_BATMAN_ADV_DEBUG=y CONFIG_BATMAN_ADV_NC=y
sparse next linux-2.6.30 CONFIG_BATMAN_ADV_BLA=n CONFIG_BATMAN_ADV_DAT=n CONFIG_BATMAN_ADV_DEBUG=y CONFIG_BATMAN_ADV_NC=n
sparse next linux-2.6.30 CONFIG_BATMAN_ADV_BLA=n CONFIG_BATMAN_ADV_DAT=y CONFIG_BATMAN_ADV_DEBUG=n CONFIG_BATMAN_ADV_NC=n
sparse next linux-2.6.30 CONFIG_BATMAN_ADV_BLA=n CONFIG_BATMAN_ADV_DAT=y CONFIG_BATMAN_ADV_DEBUG=y CONFIG_BATMAN_ADV_NC=n
sparse next linux-2.6.30 CONFIG_BATMAN_ADV_BLA=y CONFIG_BATMAN_ADV_DAT=y CONFIG_BATMAN_ADV_DEBUG=y CONFIG_BATMAN_ADV_NC=y
sparse next linux-2.6.31 CONFIG_BATMAN_ADV_BLA=n CONFIG_BATMAN_ADV_DAT=n CONFIG_BATMAN_ADV_DEBUG=y CONFIG_BATMAN_ADV_NC=n
sparse next linux-2.6.31 CONFIG_BATMAN_ADV_BLA=n CONFIG_BATMAN_ADV_DAT=y CONFIG_BATMAN_ADV_DEBUG=n CONFIG_BATMAN_ADV_NC=n
sparse next linux-2.6.31 CONFIG_BATMAN_ADV_BLA=n CONFIG_BATMAN_ADV_DAT=y CONFIG_BATMAN_ADV_DEBUG=y CONFIG_BATMAN_ADV_NC=n
sparse next linux-2.6.31 CONFIG_BATMAN_ADV_BLA=y CONFIG_BATMAN_ADV_DAT=y CONFIG_BATMAN_ADV_DEBUG=y CONFIG_BATMAN_ADV_NC=y
sparse next linux-2.6.32 CONFIG_BATMAN_ADV_BLA=n CONFIG_BATMAN_ADV_DAT=n CONFIG_BATMAN_ADV_DEBUG=y CONFIG_BATMAN_ADV_NC=n
sparse next linux-2.6.32 CONFIG_BATMAN_ADV_BLA=n CONFIG_BATMAN_ADV_DAT=y CONFIG_BATMAN_ADV_DEBUG=n CONFIG_BATMAN_ADV_NC=n
sparse next linux-2.6.32 CONFIG_BATMAN_ADV_BLA=n CONFIG_BATMAN_ADV_DAT=y CONFIG_BATMAN_ADV_DEBUG=y CONFIG_BATMAN_ADV_NC=n
sparse next linux-2.6.32 CONFIG_BATMAN_ADV_BLA=y CONFIG_BATMAN_ADV_DAT=y CONFIG_BATMAN_ADV_DEBUG=y CONFIG_BATMAN_ADV_NC=y
sparse next linux-2.6.34 CONFIG_BATMAN_ADV_BLA=n CONFIG_BATMAN_ADV_DAT=n CONFIG_BATMAN_ADV_DEBUG=y CONFIG_BATMAN_ADV_NC=n
sparse next linux-2.6.34 CONFIG_BATMAN_ADV_BLA=n CONFIG_BATMAN_ADV_DAT=y CONFIG_BATMAN_ADV_DEBUG=n CONFIG_BATMAN_ADV_NC=n
sparse next linux-2.6.34 CONFIG_BATMAN_ADV_BLA=n CONFIG_BATMAN_ADV_DAT=y CONFIG_BATMAN_ADV_DEBUG=y CONFIG_BATMAN_ADV_NC=n
sparse next linux-2.6.34 CONFIG_BATMAN_ADV_BLA=y CONFIG_BATMAN_ADV_DAT=y CONFIG_BATMAN_ADV_DEBUG=y CONFIG_BATMAN_ADV_NC=y
sparse next linux-2.6.35 CONFIG_BATMAN_ADV_BLA=n CONFIG_BATMAN_ADV_DAT=n CONFIG_BATMAN_ADV_DEBUG=y CONFIG_BATMAN_ADV_NC=n
sparse next linux-2.6.35 CONFIG_BATMAN_ADV_BLA=n CONFIG_BATMAN_ADV_DAT=y CONFIG_BATMAN_ADV_DEBUG=n CONFIG_BATMAN_ADV_NC=n
sparse next linux-2.6.35 CONFIG_BATMAN_ADV_BLA=n CONFIG_BATMAN_ADV_DAT=y CONFIG_BATMAN_ADV_DEBUG=y CONFIG_BATMAN_ADV_NC=n
sparse next linux-2.6.35 CONFIG_BATMAN_ADV_BLA=y CONFIG_BATMAN_ADV_DAT=y CONFIG_BATMAN_ADV_DEBUG=y CONFIG_BATMAN_ADV_NC=y
sparse next linux-2.6.36 CONFIG_BATMAN_ADV_BLA=n CONFIG_BATMAN_ADV_DAT=n CONFIG_BATMAN_ADV_DEBUG=y CONFIG_BATMAN_ADV_NC=n
sparse next linux-2.6.36 CONFIG_BATMAN_ADV_BLA=n CONFIG_BATMAN_ADV_DAT=y CONFIG_BATMAN_ADV_DEBUG=n CONFIG_BATMAN_ADV_NC=n
sparse next linux-2.6.36 CONFIG_BATMAN_ADV_BLA=n CONFIG_BATMAN_ADV_DAT=y CONFIG_BATMAN_ADV_DEBUG=y CONFIG_BATMAN_ADV_NC=n
sparse next linux-2.6.36 CONFIG_BATMAN_ADV_BLA=y CONFIG_BATMAN_ADV_DAT=y CONFIG_BATMAN_ADV_DEBUG=y CONFIG_BATMAN_ADV_NC=y
sparse next linux-2.6.37 CONFIG_BATMAN_ADV_BLA=n CONFIG_BATMAN_ADV_DAT=n CONFIG_BATMAN_ADV_DEBUG=y CONFIG_BATMAN_ADV_NC=n
sparse next linux-2.6.37 CONFIG_BATMAN_ADV_BLA=n CONFIG_BATMAN_ADV_DAT=y CONFIG_BATMAN_ADV_DEBUG=n CONFIG_BATMAN_ADV_NC=n
sparse next linux-2.6.37 CONFIG_BATMAN_ADV_BLA=n CONFIG_BATMAN_ADV_DAT=y CONFIG_BATMAN_ADV_DEBUG=y CONFIG_BATMAN_ADV_NC=n
sparse next linux-2.6.37 CONFIG_BATMAN_ADV_BLA=y CONFIG_BATMAN_ADV_DAT=y CONFIG_BATMAN_ADV_DEBUG=y CONFIG_BATMAN_ADV_NC=y
sparse next linux-2.6.38 CONFIG_BATMAN_ADV_BLA=n CONFIG_BATMAN_ADV_DAT=n CONFIG_BATMAN_ADV_DEBUG=y CONFIG_BATMAN_ADV_NC=n
sparse next linux-2.6.38 CONFIG_BATMAN_ADV_BLA=n CONFIG_BATMAN_ADV_DAT=y CONFIG_BATMAN_ADV_DEBUG=n CONFIG_BATMAN_ADV_NC=n
sparse next linux-2.6.38 CONFIG_BATMAN_ADV_BLA=n CONFIG_BATMAN_ADV_DAT=y CONFIG_BATMAN_ADV_DEBUG=y CONFIG_BATMAN_ADV_NC=n
sparse next linux-2.6.38 CONFIG_BATMAN_ADV_BLA=y CONFIG_BATMAN_ADV_DAT=y CONFIG_BATMAN_ADV_DEBUG=y CONFIG_BATMAN_ADV_NC=y

Output of different failed tests
================================

checkpatch next bridge_loop_avoidance.c:
>>>>>>>>
WARNING: Prefer seq_puts to seq_printf
#1613: FILE: bridge_loop_avoidance.c:1613:
+	seq_printf(seq,

WARNING: Prefer seq_puts to seq_printf
#1658: FILE: bridge_loop_avoidance.c:1658:
+	seq_printf(seq,

WARNING: Prefer seq_puts to seq_printf
#1679: FILE: bridge_loop_avoidance.c:1679:
+			seq_printf(seq,

total: 0 errors, 3 warnings, 0 checks, 1690 lines checked

checkpatch next gateway_client.c:
>>>>>>>>
WARNING: Prefer seq_puts to seq_printf
#483: FILE: gateway_client.c:483:
+	seq_printf(seq,

total: 0 errors, 1 warnings, 0 checks, 712 lines checked

checkpatch next main.c:
>>>>>>>>
WARNING: Prefer seq_puts to seq_printf
#215: FILE: main.c:215:
+		seq_printf(seq,

WARNING: Prefer seq_puts to seq_printf
#224: FILE: main.c:224:
+	seq_printf(seq,

total: 0 errors, 2 warnings, 0 checks, 501 lines checked

checkpatch next translation-table.c:
>>>>>>>>
WARNING: Prefer seq_puts to seq_printf
#477: FILE: translation-table.c:477:
+	seq_printf(seq,

WARNING: Prefer seq_puts to seq_printf
#976: FILE: translation-table.c:976:
+		seq_printf(seq,

WARNING: Prefer seq_puts to seq_printf
#1018: FILE: translation-table.c:1018:
+	seq_printf(seq,

total: 0 errors, 3 warnings, 0 checks, 2573 lines checked

cppcheck next:
>>>>>>>>
[gateway_client.c:181]: (style) Variable 'max_gw_factor' is assigned a value that is never used
[gateway_client.c:178]: (style) Variable 'max_tq' is assigned a value that is never used
[translation-table.c:944]: (style) Variable 'best_tq' is assigned a value that is never used

sparse master linux-2.6.32 CONFIG_BATMAN_ADV_BLA=n CONFIG_BATMAN_ADV_DAT=n CONFIG_BATMAN_ADV_DEBUG=n CONFIG_BATMAN_ADV_NC=y:
>>>>>>>>
include/linux/skbuff.h:357:41: error: invalid bitfield specifier for type restricted __be16.
include/linux/skbuff.h:357:41: error: invalid bitfield specifier for type restricted __be16.
include/linux/skbuff.h:357:41: error: invalid bitfield specifier for type restricted __be16.
include/linux/skbuff.h:357:41: error: invalid bitfield specifier for type restricted __be16.
include/linux/skbuff.h:357:41: error: invalid bitfield specifier for type restricted __be16.
include/linux/skbuff.h:357:41: error: invalid bitfield specifier for type restricted __be16.
include/linux/skbuff.h:357:41: error: invalid bitfield specifier for type restricted __be16.
/home/batman/build_test/tmp/hard-interface.c:381:43: error: subtraction of functions? Share your drugs
include/linux/skbuff.h:357:41: error: invalid bitfield specifier for type restricted __be16.
include/linux/skbuff.h:357:41: error: invalid bitfield specifier for type restricted __be16.
include/linux/skbuff.h:357:41: error: invalid bitfield specifier for type restricted __be16.
include/linux/skbuff.h:357:41: error: invalid bitfield specifier for type restricted __be16.
include/linux/skbuff.h:357:41: error: invalid bitfield specifier for type restricted __be16.
include/linux/skbuff.h:357:41: error: invalid bitfield specifier for type restricted __be16.
include/linux/skbuff.h:357:41: error: invalid bitfield specifier for type restricted __be16.
include/linux/skbuff.h:357:41: error: invalid bitfield specifier for type restricted __be16.
include/linux/skbuff.h:357:41: error: invalid bitfield specifier for type restricted __be16.
include/linux/skbuff.h:357:41: error: invalid bitfield specifier for type restricted __be16.
include/linux/skbuff.h:357:41: error: invalid bitfield specifier for type restricted __be16.
include/linux/skbuff.h:357:41: error: invalid bitfield specifier for type restricted __be16.
include/linux/skbuff.h:357:41: error: invalid bitfield specifier for type restricted __be16.

sparse master linux-2.6.32 CONFIG_BATMAN_ADV_BLA=n CONFIG_BATMAN_ADV_DAT=n CONFIG_BATMAN_ADV_DEBUG=y CONFIG_BATMAN_ADV_NC=n:
>>>>>>>>
include/linux/skbuff.h:357:41: error: invalid bitfield specifier for type restricted __be16.
include/linux/skbuff.h:357:41: error: invalid bitfield specifier for type restricted __be16.
include/linux/skbuff.h:357:41: error: invalid bitfield specifier for type restricted __be16.
include/linux/skbuff.h:357:41: error: invalid bitfield specifier for type restricted __be16.
include/linux/skbuff.h:357:41: error: invalid bitfield specifier for type restricted __be16.
include/linux/skbuff.h:357:41: error: invalid bitfield specifier for type restricted __be16.
include/linux/skbuff.h:357:41: error: invalid bitfield specifier for type restricted __be16.
/home/batman/build_test/tmp/hard-interface.c:381:43: error: subtraction of functions? Share your drugs
include/linux/skbuff.h:357:41: error: invalid bitfield specifier for type restricted __be16.
include/linux/skbuff.h:357:41: error: invalid bitfield specifier for type restricted __be16.
include/linux/skbuff.h:357:41: error: invalid bitfield specifier for type restricted __be16.
include/linux/skbuff.h:357:41: error: invalid bitfield specifier for type restricted __be16.
include/linux/skbuff.h:357:41: error: invalid bitfield specifier for type restricted __be16.
include/linux/skbuff.h:357:41: error: invalid bitfield specifier for type restricted __be16.
include/linux/skbuff.h:357:41: error: invalid bitfield specifier for type restricted __be16.
include/linux/skbuff.h:357:41: error: invalid bitfield specifier for type restricted __be16.
include/linux/skbuff.h:357:41: error: invalid bitfield specifier for type restricted __be16.
include/linux/skbuff.h:357:41: error: invalid bitfield specifier for type restricted __be16.
include/linux/skbuff.h:357:41: error: invalid bitfield specifier for type restricted __be16.
include/linux/skbuff.h:357:41: error: invalid bitfield specifier for type restricted __be16.

sparse master linux-2.6.32 CONFIG_BATMAN_ADV_BLA=y CONFIG_BATMAN_ADV_DAT=n CONFIG_BATMAN_ADV_DEBUG=y CONFIG_BATMAN_ADV_NC=y:
>>>>>>>>
include/linux/skbuff.h:357:41: error: invalid bitfield specifier for type restricted __be16.
include/linux/skbuff.h:357:41: error: invalid bitfield specifier for type restricted __be16.
include/linux/skbuff.h:357:41: error: invalid bitfield specifier for type restricted __be16.
include/linux/skbuff.h:357:41: error: invalid bitfield specifier for type restricted __be16.
include/linux/skbuff.h:357:41: error: invalid bitfield specifier for type restricted __be16.
include/linux/skbuff.h:357:41: error: invalid bitfield specifier for type restricted __be16.
include/linux/skbuff.h:357:41: error: invalid bitfield specifier for type restricted __be16.
include/linux/skbuff.h:357:41: error: invalid bitfield specifier for type restricted __be16.
/home/batman/build_test/tmp/hard-interface.c:381:43: error: subtraction of functions? Share your drugs
include/linux/skbuff.h:357:41: error: invalid bitfield specifier for type restricted __be16.
include/linux/skbuff.h:357:41: error: invalid bitfield specifier for type restricted __be16.
include/linux/skbuff.h:357:41: error: invalid bitfield specifier for type restricted __be16.
include/linux/skbuff.h:357:41: error: invalid bitfield specifier for type restricted __be16.
include/linux/skbuff.h:357:41: error: invalid bitfield specifier for type restricted __be16.
include/linux/skbuff.h:357:41: error: invalid bitfield specifier for type restricted __be16.
include/linux/skbuff.h:357:41: error: invalid bitfield specifier for type restricted __be16.
include/linux/skbuff.h:357:41: error: invalid bitfield specifier for type restricted __be16.
include/linux/skbuff.h:357:41: error: invalid bitfield specifier for type restricted __be16.
include/linux/skbuff.h:357:41: error: invalid bitfield specifier for type restricted __be16.
include/linux/skbuff.h:357:41: error: invalid bitfield specifier for type restricted __be16.
include/linux/skbuff.h:357:41: error: invalid bitfield specifier for type restricted __be16.
include/linux/skbuff.h:357:41: error: invalid bitfield specifier for type restricted __be16.

sparse master linux-2.6.38 CONFIG_BATMAN_ADV_BLA=n CONFIG_BATMAN_ADV_DAT=n CONFIG_BATMAN_ADV_DEBUG=y CONFIG_BATMAN_ADV_NC=n:
>>>>>>>>
/home/batman/build_test/tmp/hard-interface.c:381:43: error: subtraction of functions? Share your drugs

sparse next linux-2.6.32 CONFIG_BATMAN_ADV_BLA=n CONFIG_BATMAN_ADV_DAT=n CONFIG_BATMAN_ADV_DEBUG=y CONFIG_BATMAN_ADV_NC=n:
>>>>>>>>
include/linux/skbuff.h:357:41: error: invalid bitfield specifier for type restricted __be16.
include/linux/skbuff.h:357:41: error: invalid bitfield specifier for type restricted __be16.
include/linux/skbuff.h:357:41: error: invalid bitfield specifier for type restricted __be16.
include/linux/skbuff.h:357:41: error: invalid bitfield specifier for type restricted __be16.
include/linux/skbuff.h:357:41: error: invalid bitfield specifier for type restricted __be16.
include/linux/skbuff.h:357:41: error: invalid bitfield specifier for type restricted __be16.
include/linux/skbuff.h:357:41: error: invalid bitfield specifier for type restricted __be16.
/home/batman/build_test/tmp/hard-interface.c:329:43: error: subtraction of functions? Share your drugs
include/linux/skbuff.h:357:41: error: invalid bitfield specifier for type restricted __be16.
include/linux/skbuff.h:357:41: error: invalid bitfield specifier for type restricted __be16.
include/linux/skbuff.h:357:41: error: invalid bitfield specifier for type restricted __be16.
include/linux/skbuff.h:357:41: error: invalid bitfield specifier for type restricted __be16.
include/linux/skbuff.h:357:41: error: invalid bitfield specifier for type restricted __be16.
include/linux/skbuff.h:357:41: error: invalid bitfield specifier for type restricted __be16.
include/linux/skbuff.h:357:41: error: invalid bitfield specifier for type restricted __be16.
include/linux/skbuff.h:357:41: error: invalid bitfield specifier for type restricted __be16.
include/linux/skbuff.h:357:41: error: invalid bitfield specifier for type restricted __be16.
include/linux/skbuff.h:357:41: error: invalid bitfield specifier for type restricted __be16.
include/linux/skbuff.h:357:41: error: invalid bitfield specifier for type restricted __be16.
include/linux/skbuff.h:357:41: error: invalid bitfield specifier for type restricted __be16.

sparse next linux-2.6.32 CONFIG_BATMAN_ADV_BLA=n CONFIG_BATMAN_ADV_DAT=y CONFIG_BATMAN_ADV_DEBUG=y CONFIG_BATMAN_ADV_NC=n:
>>>>>>>>
include/linux/skbuff.h:357:41: error: invalid bitfield specifier for type restricted __be16.
include/linux/skbuff.h:357:41: error: invalid bitfield specifier for type restricted __be16.
include/linux/skbuff.h:357:41: error: invalid bitfield specifier for type restricted __be16.
include/linux/skbuff.h:357:41: error: invalid bitfield specifier for type restricted __be16.
include/linux/skbuff.h:357:41: error: invalid bitfield specifier for type restricted __be16.
include/linux/skbuff.h:357:41: error: invalid bitfield specifier for type restricted __be16.
include/linux/skbuff.h:357:41: error: invalid bitfield specifier for type restricted __be16.
include/linux/skbuff.h:357:41: error: invalid bitfield specifier for type restricted __be16.
/home/batman/build_test/tmp/hard-interface.c:329:43: error: subtraction of functions? Share your drugs
include/linux/skbuff.h:357:41: error: invalid bitfield specifier for type restricted __be16.
include/linux/skbuff.h:357:41: error: invalid bitfield specifier for type restricted __be16.
include/linux/skbuff.h:357:41: error: invalid bitfield specifier for type restricted __be16.
include/linux/skbuff.h:357:41: error: invalid bitfield specifier for type restricted __be16.
include/linux/skbuff.h:357:41: error: invalid bitfield specifier for type restricted __be16.
include/linux/skbuff.h:357:41: error: invalid bitfield specifier for type restricted __be16.
include/linux/skbuff.h:357:41: error: invalid bitfield specifier for type restricted __be16.
include/linux/skbuff.h:357:41: error: invalid bitfield specifier for type restricted __be16.
include/linux/skbuff.h:357:41: error: invalid bitfield specifier for type restricted __be16.
include/linux/skbuff.h:357:41: error: invalid bitfield specifier for type restricted __be16.
include/linux/skbuff.h:357:41: error: invalid bitfield specifier for type restricted __be16.
include/linux/skbuff.h:357:41: error: invalid bitfield specifier for type restricted __be16.

sparse next linux-2.6.32 CONFIG_BATMAN_ADV_BLA=y CONFIG_BATMAN_ADV_DAT=y CONFIG_BATMAN_ADV_DEBUG=y CONFIG_BATMAN_ADV_NC=y:
>>>>>>>>
include/linux/skbuff.h:357:41: error: invalid bitfield specifier for type restricted __be16.
include/linux/skbuff.h:357:41: error: invalid bitfield specifier for type restricted __be16.
include/linux/skbuff.h:357:41: error: invalid bitfield specifier for type restricted __be16.
include/linux/skbuff.h:357:41: error: invalid bitfield specifier for type restricted __be16.
include/linux/skbuff.h:357:41: error: invalid bitfield specifier for type restricted __be16.
include/linux/skbuff.h:357:41: error: invalid bitfield specifier for type restricted __be16.
include/linux/skbuff.h:357:41: error: invalid bitfield specifier for type restricted __be16.
include/linux/skbuff.h:357:41: error: invalid bitfield specifier for type restricted __be16.
include/linux/skbuff.h:357:41: error: invalid bitfield specifier for type restricted __be16.
/home/batman/build_test/tmp/hard-interface.c:329:43: error: subtraction of functions? Share your drugs
include/linux/skbuff.h:357:41: error: invalid bitfield specifier for type restricted __be16.
include/linux/skbuff.h:357:41: error: invalid bitfield specifier for type restricted __be16.
include/linux/skbuff.h:357:41: error: invalid bitfield specifier for type restricted __be16.
include/linux/skbuff.h:357:41: error: invalid bitfield specifier for type restricted __be16.
include/linux/skbuff.h:357:41: error: invalid bitfield specifier for type restricted __be16.
include/linux/skbuff.h:357:41: error: invalid bitfield specifier for type restricted __be16.
include/linux/skbuff.h:357:41: error: invalid bitfield specifier for type restricted __be16.
include/linux/skbuff.h:357:41: error: invalid bitfield specifier for type restricted __be16.
include/linux/skbuff.h:357:41: error: invalid bitfield specifier for type restricted __be16.
include/linux/skbuff.h:357:41: error: invalid bitfield specifier for type restricted __be16.
include/linux/skbuff.h:357:41: error: invalid bitfield specifier for type restricted __be16.
include/linux/skbuff.h:357:41: error: invalid bitfield specifier for type restricted __be16.
include/linux/skbuff.h:357:41: error: invalid bitfield specifier for type restricted __be16.

sparse next linux-2.6.38 CONFIG_BATMAN_ADV_BLA=y CONFIG_BATMAN_ADV_DAT=y CONFIG_BATMAN_ADV_DEBUG=y CONFIG_BATMAN_ADV_NC=y:
>>>>>>>>
/home/batman/build_test/tmp/hard-interface.c:329:43: error: subtraction of functions? Share your drugs



More information about the linux-merge mailing list