Build check errors found: 2013-03-19

postmaster at open-mesh.org postmaster at open-mesh.org
Tue Mar 19 01:12:21 CET 2013


Name of failed tests
====================

cppcheck master
cppcheck next
sparse master linux-2.6.32 CONFIG_BATMAN_ADV_BLA=n CONFIG_BATMAN_ADV_DAT=y CONFIG_BATMAN_ADV_DEBUG=n CONFIG_BATMAN_ADV_NC=y
sparse master linux-2.6.32 CONFIG_BATMAN_ADV_BLA=n CONFIG_BATMAN_ADV_DAT=y CONFIG_BATMAN_ADV_DEBUG=y CONFIG_BATMAN_ADV_NC=y
sparse master linux-2.6.32 CONFIG_BATMAN_ADV_BLA=y CONFIG_BATMAN_ADV_DAT=n CONFIG_BATMAN_ADV_DEBUG=n CONFIG_BATMAN_ADV_NC=y
sparse master linux-2.6.32 CONFIG_BATMAN_ADV_BLA=y CONFIG_BATMAN_ADV_DAT=n CONFIG_BATMAN_ADV_DEBUG=y CONFIG_BATMAN_ADV_NC=y
sparse next linux-2.6.32 CONFIG_BATMAN_ADV_BLA=n CONFIG_BATMAN_ADV_DAT=n CONFIG_BATMAN_ADV_DEBUG=n CONFIG_BATMAN_ADV_NC=n
sparse next linux-2.6.32 CONFIG_BATMAN_ADV_BLA=n CONFIG_BATMAN_ADV_DAT=y CONFIG_BATMAN_ADV_DEBUG=y CONFIG_BATMAN_ADV_NC=y
sparse next linux-2.6.32 CONFIG_BATMAN_ADV_BLA=y CONFIG_BATMAN_ADV_DAT=n CONFIG_BATMAN_ADV_DEBUG=n CONFIG_BATMAN_ADV_NC=y
sparse next linux-2.6.32 CONFIG_BATMAN_ADV_BLA=y CONFIG_BATMAN_ADV_DAT=y CONFIG_BATMAN_ADV_DEBUG=n CONFIG_BATMAN_ADV_NC=y

Output of different failed tests
================================

cppcheck next:
>>>>>>>>
[gateway_client.c:181]: (style) Variable 'max_gw_factor' is assigned a value that is never used
[gateway_client.c:178]: (style) Variable 'max_tq' is assigned a value that is never used
[translation-table.c:944]: (style) Variable 'best_tq' is assigned a value that is never used

sparse next linux-2.6.32 CONFIG_BATMAN_ADV_BLA=n CONFIG_BATMAN_ADV_DAT=n CONFIG_BATMAN_ADV_DEBUG=n CONFIG_BATMAN_ADV_NC=n:
>>>>>>>>
include/linux/skbuff.h:357:41: error: invalid bitfield specifier for type restricted __be16.
include/linux/skbuff.h:357:41: error: invalid bitfield specifier for type restricted __be16.
include/linux/skbuff.h:357:41: error: invalid bitfield specifier for type restricted __be16.
include/linux/skbuff.h:357:41: error: invalid bitfield specifier for type restricted __be16.
include/linux/skbuff.h:357:41: error: invalid bitfield specifier for type restricted __be16.
include/linux/skbuff.h:357:41: error: invalid bitfield specifier for type restricted __be16.
include/linux/skbuff.h:357:41: error: invalid bitfield specifier for type restricted __be16.
include/linux/skbuff.h:357:41: error: invalid bitfield specifier for type restricted __be16.
include/linux/skbuff.h:357:41: error: invalid bitfield specifier for type restricted __be16.
include/linux/skbuff.h:357:41: error: invalid bitfield specifier for type restricted __be16.
include/linux/skbuff.h:357:41: error: invalid bitfield specifier for type restricted __be16.
include/linux/skbuff.h:357:41: error: invalid bitfield specifier for type restricted __be16.
include/linux/skbuff.h:357:41: error: invalid bitfield specifier for type restricted __be16.
include/linux/skbuff.h:357:41: error: invalid bitfield specifier for type restricted __be16.
include/linux/skbuff.h:357:41: error: invalid bitfield specifier for type restricted __be16.
include/linux/skbuff.h:357:41: error: invalid bitfield specifier for type restricted __be16.
include/linux/skbuff.h:357:41: error: invalid bitfield specifier for type restricted __be16.
include/linux/skbuff.h:357:41: error: invalid bitfield specifier for type restricted __be16.
include/linux/skbuff.h:357:41: error: invalid bitfield specifier for type restricted __be16.

sparse next linux-2.6.32 CONFIG_BATMAN_ADV_BLA=n CONFIG_BATMAN_ADV_DAT=y CONFIG_BATMAN_ADV_DEBUG=y CONFIG_BATMAN_ADV_NC=y:
>>>>>>>>
include/linux/skbuff.h:357:41: error: invalid bitfield specifier for type restricted __be16.
include/linux/skbuff.h:357:41: error: invalid bitfield specifier for type restricted __be16.
include/linux/skbuff.h:357:41: error: invalid bitfield specifier for type restricted __be16.
include/linux/skbuff.h:357:41: error: invalid bitfield specifier for type restricted __be16.
include/linux/skbuff.h:357:41: error: invalid bitfield specifier for type restricted __be16.
include/linux/skbuff.h:357:41: error: invalid bitfield specifier for type restricted __be16.
include/linux/skbuff.h:357:41: error: invalid bitfield specifier for type restricted __be16.
include/linux/skbuff.h:357:41: error: invalid bitfield specifier for type restricted __be16.
include/linux/skbuff.h:357:41: error: invalid bitfield specifier for type restricted __be16.
include/linux/skbuff.h:357:41: error: invalid bitfield specifier for type restricted __be16.
include/linux/skbuff.h:357:41: error: invalid bitfield specifier for type restricted __be16.
include/linux/skbuff.h:357:41: error: invalid bitfield specifier for type restricted __be16.
include/linux/skbuff.h:357:41: error: invalid bitfield specifier for type restricted __be16.
include/linux/skbuff.h:357:41: error: invalid bitfield specifier for type restricted __be16.
include/linux/skbuff.h:357:41: error: invalid bitfield specifier for type restricted __be16.
include/linux/skbuff.h:357:41: error: invalid bitfield specifier for type restricted __be16.
include/linux/skbuff.h:357:41: error: invalid bitfield specifier for type restricted __be16.
include/linux/skbuff.h:357:41: error: invalid bitfield specifier for type restricted __be16.
include/linux/skbuff.h:357:41: error: invalid bitfield specifier for type restricted __be16.
include/linux/skbuff.h:357:41: error: invalid bitfield specifier for type restricted __be16.
include/linux/skbuff.h:357:41: error: invalid bitfield specifier for type restricted __be16.

sparse next linux-2.6.32 CONFIG_BATMAN_ADV_BLA=y CONFIG_BATMAN_ADV_DAT=y CONFIG_BATMAN_ADV_DEBUG=n CONFIG_BATMAN_ADV_NC=y:
>>>>>>>>
include/linux/skbuff.h:357:41: error: invalid bitfield specifier for type restricted __be16.
include/linux/skbuff.h:357:41: error: invalid bitfield specifier for type restricted __be16.
include/linux/skbuff.h:357:41: error: invalid bitfield specifier for type restricted __be16.
include/linux/skbuff.h:357:41: error: invalid bitfield specifier for type restricted __be16.
include/linux/skbuff.h:357:41: error: invalid bitfield specifier for type restricted __be16.
include/linux/skbuff.h:357:41: error: invalid bitfield specifier for type restricted __be16.
include/linux/skbuff.h:357:41: error: invalid bitfield specifier for type restricted __be16.
include/linux/skbuff.h:357:41: error: invalid bitfield specifier for type restricted __be16.
include/linux/skbuff.h:357:41: error: invalid bitfield specifier for type restricted __be16.
include/linux/skbuff.h:357:41: error: invalid bitfield specifier for type restricted __be16.
include/linux/skbuff.h:357:41: error: invalid bitfield specifier for type restricted __be16.
include/linux/skbuff.h:357:41: error: invalid bitfield specifier for type restricted __be16.
include/linux/skbuff.h:357:41: error: invalid bitfield specifier for type restricted __be16.
include/linux/skbuff.h:357:41: error: invalid bitfield specifier for type restricted __be16.
include/linux/skbuff.h:357:41: error: invalid bitfield specifier for type restricted __be16.
include/linux/skbuff.h:357:41: error: invalid bitfield specifier for type restricted __be16.
include/linux/skbuff.h:357:41: error: invalid bitfield specifier for type restricted __be16.
include/linux/skbuff.h:357:41: error: invalid bitfield specifier for type restricted __be16.
include/linux/skbuff.h:357:41: error: invalid bitfield specifier for type restricted __be16.
include/linux/skbuff.h:357:41: error: invalid bitfield specifier for type restricted __be16.
include/linux/skbuff.h:357:41: error: invalid bitfield specifier for type restricted __be16.
include/linux/skbuff.h:357:41: error: invalid bitfield specifier for type restricted __be16.



More information about the linux-merge mailing list