Build check errors found: 2013-03-15

postmaster at open-mesh.org postmaster at open-mesh.org
Fri Mar 15 01:03:51 CET 2013


Name of failed tests
====================

cppcheck master
cppcheck next
sparse master linux-2.6.29 CONFIG_BATMAN_ADV_BLA=n CONFIG_BATMAN_ADV_DAT=y CONFIG_BATMAN_ADV_DEBUG=n CONFIG_BATMAN_ADV_NC=n
sparse master linux-2.6.29 CONFIG_BATMAN_ADV_BLA=n CONFIG_BATMAN_ADV_DAT=y CONFIG_BATMAN_ADV_DEBUG=y CONFIG_BATMAN_ADV_NC=y
sparse master linux-2.6.29 CONFIG_BATMAN_ADV_BLA=y CONFIG_BATMAN_ADV_DAT=n CONFIG_BATMAN_ADV_DEBUG=n CONFIG_BATMAN_ADV_NC=y
sparse master linux-2.6.29 CONFIG_BATMAN_ADV_BLA=y CONFIG_BATMAN_ADV_DAT=y CONFIG_BATMAN_ADV_DEBUG=n CONFIG_BATMAN_ADV_NC=y
sparse master linux-2.6.30 CONFIG_BATMAN_ADV_BLA=n CONFIG_BATMAN_ADV_DAT=y CONFIG_BATMAN_ADV_DEBUG=n CONFIG_BATMAN_ADV_NC=n
sparse master linux-2.6.30 CONFIG_BATMAN_ADV_BLA=n CONFIG_BATMAN_ADV_DAT=y CONFIG_BATMAN_ADV_DEBUG=y CONFIG_BATMAN_ADV_NC=y
sparse master linux-2.6.30 CONFIG_BATMAN_ADV_BLA=y CONFIG_BATMAN_ADV_DAT=n CONFIG_BATMAN_ADV_DEBUG=n CONFIG_BATMAN_ADV_NC=y
sparse master linux-2.6.30 CONFIG_BATMAN_ADV_BLA=y CONFIG_BATMAN_ADV_DAT=y CONFIG_BATMAN_ADV_DEBUG=n CONFIG_BATMAN_ADV_NC=y
sparse master linux-2.6.31 CONFIG_BATMAN_ADV_BLA=n CONFIG_BATMAN_ADV_DAT=y CONFIG_BATMAN_ADV_DEBUG=n CONFIG_BATMAN_ADV_NC=n
sparse master linux-2.6.31 CONFIG_BATMAN_ADV_BLA=n CONFIG_BATMAN_ADV_DAT=y CONFIG_BATMAN_ADV_DEBUG=y CONFIG_BATMAN_ADV_NC=y
sparse master linux-2.6.31 CONFIG_BATMAN_ADV_BLA=y CONFIG_BATMAN_ADV_DAT=n CONFIG_BATMAN_ADV_DEBUG=n CONFIG_BATMAN_ADV_NC=y
sparse master linux-2.6.31 CONFIG_BATMAN_ADV_BLA=y CONFIG_BATMAN_ADV_DAT=y CONFIG_BATMAN_ADV_DEBUG=n CONFIG_BATMAN_ADV_NC=y
sparse master linux-2.6.32 CONFIG_BATMAN_ADV_BLA=n CONFIG_BATMAN_ADV_DAT=y CONFIG_BATMAN_ADV_DEBUG=n CONFIG_BATMAN_ADV_NC=n
sparse master linux-2.6.32 CONFIG_BATMAN_ADV_BLA=n CONFIG_BATMAN_ADV_DAT=y CONFIG_BATMAN_ADV_DEBUG=y CONFIG_BATMAN_ADV_NC=y
sparse master linux-2.6.32 CONFIG_BATMAN_ADV_BLA=y CONFIG_BATMAN_ADV_DAT=n CONFIG_BATMAN_ADV_DEBUG=n CONFIG_BATMAN_ADV_NC=y
sparse master linux-2.6.32 CONFIG_BATMAN_ADV_BLA=y CONFIG_BATMAN_ADV_DAT=y CONFIG_BATMAN_ADV_DEBUG=n CONFIG_BATMAN_ADV_NC=y
sparse master linux-2.6.34 CONFIG_BATMAN_ADV_BLA=n CONFIG_BATMAN_ADV_DAT=y CONFIG_BATMAN_ADV_DEBUG=n CONFIG_BATMAN_ADV_NC=n
sparse master linux-2.6.34 CONFIG_BATMAN_ADV_BLA=n CONFIG_BATMAN_ADV_DAT=y CONFIG_BATMAN_ADV_DEBUG=y CONFIG_BATMAN_ADV_NC=y
sparse master linux-2.6.34 CONFIG_BATMAN_ADV_BLA=y CONFIG_BATMAN_ADV_DAT=n CONFIG_BATMAN_ADV_DEBUG=n CONFIG_BATMAN_ADV_NC=y
sparse master linux-2.6.34 CONFIG_BATMAN_ADV_BLA=y CONFIG_BATMAN_ADV_DAT=y CONFIG_BATMAN_ADV_DEBUG=n CONFIG_BATMAN_ADV_NC=y
sparse master linux-2.6.35 CONFIG_BATMAN_ADV_BLA=n CONFIG_BATMAN_ADV_DAT=y CONFIG_BATMAN_ADV_DEBUG=n CONFIG_BATMAN_ADV_NC=n
sparse master linux-2.6.35 CONFIG_BATMAN_ADV_BLA=n CONFIG_BATMAN_ADV_DAT=y CONFIG_BATMAN_ADV_DEBUG=y CONFIG_BATMAN_ADV_NC=y
sparse master linux-2.6.35 CONFIG_BATMAN_ADV_BLA=y CONFIG_BATMAN_ADV_DAT=n CONFIG_BATMAN_ADV_DEBUG=n CONFIG_BATMAN_ADV_NC=y
sparse master linux-2.6.35 CONFIG_BATMAN_ADV_BLA=y CONFIG_BATMAN_ADV_DAT=y CONFIG_BATMAN_ADV_DEBUG=n CONFIG_BATMAN_ADV_NC=y
sparse master linux-2.6.36 CONFIG_BATMAN_ADV_BLA=n CONFIG_BATMAN_ADV_DAT=y CONFIG_BATMAN_ADV_DEBUG=n CONFIG_BATMAN_ADV_NC=n
sparse master linux-2.6.36 CONFIG_BATMAN_ADV_BLA=n CONFIG_BATMAN_ADV_DAT=y CONFIG_BATMAN_ADV_DEBUG=y CONFIG_BATMAN_ADV_NC=y
sparse master linux-2.6.36 CONFIG_BATMAN_ADV_BLA=y CONFIG_BATMAN_ADV_DAT=n CONFIG_BATMAN_ADV_DEBUG=n CONFIG_BATMAN_ADV_NC=y
sparse master linux-2.6.36 CONFIG_BATMAN_ADV_BLA=y CONFIG_BATMAN_ADV_DAT=y CONFIG_BATMAN_ADV_DEBUG=n CONFIG_BATMAN_ADV_NC=y
sparse next linux-2.6.29 CONFIG_BATMAN_ADV_BLA=n CONFIG_BATMAN_ADV_DAT=n CONFIG_BATMAN_ADV_DEBUG=n CONFIG_BATMAN_ADV_NC=y
sparse next linux-2.6.29 CONFIG_BATMAN_ADV_BLA=n CONFIG_BATMAN_ADV_DAT=y CONFIG_BATMAN_ADV_DEBUG=n CONFIG_BATMAN_ADV_NC=n
sparse next linux-2.6.29 CONFIG_BATMAN_ADV_BLA=n CONFIG_BATMAN_ADV_DAT=y CONFIG_BATMAN_ADV_DEBUG=n CONFIG_BATMAN_ADV_NC=y
sparse next linux-2.6.29 CONFIG_BATMAN_ADV_BLA=n CONFIG_BATMAN_ADV_DAT=y CONFIG_BATMAN_ADV_DEBUG=y CONFIG_BATMAN_ADV_NC=n
sparse next linux-2.6.30 CONFIG_BATMAN_ADV_BLA=n CONFIG_BATMAN_ADV_DAT=n CONFIG_BATMAN_ADV_DEBUG=n CONFIG_BATMAN_ADV_NC=y
sparse next linux-2.6.30 CONFIG_BATMAN_ADV_BLA=n CONFIG_BATMAN_ADV_DAT=y CONFIG_BATMAN_ADV_DEBUG=n CONFIG_BATMAN_ADV_NC=n
sparse next linux-2.6.30 CONFIG_BATMAN_ADV_BLA=n CONFIG_BATMAN_ADV_DAT=y CONFIG_BATMAN_ADV_DEBUG=n CONFIG_BATMAN_ADV_NC=y
sparse next linux-2.6.30 CONFIG_BATMAN_ADV_BLA=n CONFIG_BATMAN_ADV_DAT=y CONFIG_BATMAN_ADV_DEBUG=y CONFIG_BATMAN_ADV_NC=n
sparse next linux-2.6.31 CONFIG_BATMAN_ADV_BLA=n CONFIG_BATMAN_ADV_DAT=n CONFIG_BATMAN_ADV_DEBUG=n CONFIG_BATMAN_ADV_NC=y
sparse next linux-2.6.31 CONFIG_BATMAN_ADV_BLA=n CONFIG_BATMAN_ADV_DAT=y CONFIG_BATMAN_ADV_DEBUG=n CONFIG_BATMAN_ADV_NC=n
sparse next linux-2.6.31 CONFIG_BATMAN_ADV_BLA=n CONFIG_BATMAN_ADV_DAT=y CONFIG_BATMAN_ADV_DEBUG=n CONFIG_BATMAN_ADV_NC=y
sparse next linux-2.6.31 CONFIG_BATMAN_ADV_BLA=n CONFIG_BATMAN_ADV_DAT=y CONFIG_BATMAN_ADV_DEBUG=y CONFIG_BATMAN_ADV_NC=n
sparse next linux-2.6.32 CONFIG_BATMAN_ADV_BLA=n CONFIG_BATMAN_ADV_DAT=n CONFIG_BATMAN_ADV_DEBUG=n CONFIG_BATMAN_ADV_NC=y
sparse next linux-2.6.32 CONFIG_BATMAN_ADV_BLA=n CONFIG_BATMAN_ADV_DAT=y CONFIG_BATMAN_ADV_DEBUG=n CONFIG_BATMAN_ADV_NC=n
sparse next linux-2.6.32 CONFIG_BATMAN_ADV_BLA=n CONFIG_BATMAN_ADV_DAT=y CONFIG_BATMAN_ADV_DEBUG=n CONFIG_BATMAN_ADV_NC=y
sparse next linux-2.6.32 CONFIG_BATMAN_ADV_BLA=n CONFIG_BATMAN_ADV_DAT=y CONFIG_BATMAN_ADV_DEBUG=y CONFIG_BATMAN_ADV_NC=n
sparse next linux-2.6.34 CONFIG_BATMAN_ADV_BLA=n CONFIG_BATMAN_ADV_DAT=n CONFIG_BATMAN_ADV_DEBUG=n CONFIG_BATMAN_ADV_NC=y
sparse next linux-2.6.34 CONFIG_BATMAN_ADV_BLA=n CONFIG_BATMAN_ADV_DAT=y CONFIG_BATMAN_ADV_DEBUG=n CONFIG_BATMAN_ADV_NC=n
sparse next linux-2.6.34 CONFIG_BATMAN_ADV_BLA=n CONFIG_BATMAN_ADV_DAT=y CONFIG_BATMAN_ADV_DEBUG=n CONFIG_BATMAN_ADV_NC=y
sparse next linux-2.6.34 CONFIG_BATMAN_ADV_BLA=n CONFIG_BATMAN_ADV_DAT=y CONFIG_BATMAN_ADV_DEBUG=y CONFIG_BATMAN_ADV_NC=n
sparse next linux-2.6.35 CONFIG_BATMAN_ADV_BLA=n CONFIG_BATMAN_ADV_DAT=n CONFIG_BATMAN_ADV_DEBUG=n CONFIG_BATMAN_ADV_NC=y
sparse next linux-2.6.35 CONFIG_BATMAN_ADV_BLA=n CONFIG_BATMAN_ADV_DAT=y CONFIG_BATMAN_ADV_DEBUG=n CONFIG_BATMAN_ADV_NC=n
sparse next linux-2.6.35 CONFIG_BATMAN_ADV_BLA=n CONFIG_BATMAN_ADV_DAT=y CONFIG_BATMAN_ADV_DEBUG=n CONFIG_BATMAN_ADV_NC=y
sparse next linux-2.6.35 CONFIG_BATMAN_ADV_BLA=n CONFIG_BATMAN_ADV_DAT=y CONFIG_BATMAN_ADV_DEBUG=y CONFIG_BATMAN_ADV_NC=n
sparse next linux-2.6.36 CONFIG_BATMAN_ADV_BLA=n CONFIG_BATMAN_ADV_DAT=n CONFIG_BATMAN_ADV_DEBUG=n CONFIG_BATMAN_ADV_NC=y
sparse next linux-2.6.36 CONFIG_BATMAN_ADV_BLA=n CONFIG_BATMAN_ADV_DAT=y CONFIG_BATMAN_ADV_DEBUG=n CONFIG_BATMAN_ADV_NC=n
sparse next linux-2.6.36 CONFIG_BATMAN_ADV_BLA=n CONFIG_BATMAN_ADV_DAT=y CONFIG_BATMAN_ADV_DEBUG=n CONFIG_BATMAN_ADV_NC=y
sparse next linux-2.6.36 CONFIG_BATMAN_ADV_BLA=n CONFIG_BATMAN_ADV_DAT=y CONFIG_BATMAN_ADV_DEBUG=y CONFIG_BATMAN_ADV_NC=n
unused_symbols master linux-2.6.29 CONFIG_BATMAN_ADV_BLA=n CONFIG_BATMAN_ADV_DAT=y CONFIG_BATMAN_ADV_DEBUG=n CONFIG_BATMAN_ADV_NC=n
unused_symbols master linux-2.6.29 CONFIG_BATMAN_ADV_BLA=n CONFIG_BATMAN_ADV_DAT=y CONFIG_BATMAN_ADV_DEBUG=y CONFIG_BATMAN_ADV_NC=y
unused_symbols master linux-2.6.29 CONFIG_BATMAN_ADV_BLA=y CONFIG_BATMAN_ADV_DAT=n CONFIG_BATMAN_ADV_DEBUG=n CONFIG_BATMAN_ADV_NC=y
unused_symbols master linux-2.6.29 CONFIG_BATMAN_ADV_BLA=y CONFIG_BATMAN_ADV_DAT=y CONFIG_BATMAN_ADV_DEBUG=n CONFIG_BATMAN_ADV_NC=y
unused_symbols master linux-2.6.30 CONFIG_BATMAN_ADV_BLA=n CONFIG_BATMAN_ADV_DAT=y CONFIG_BATMAN_ADV_DEBUG=n CONFIG_BATMAN_ADV_NC=n
unused_symbols master linux-2.6.30 CONFIG_BATMAN_ADV_BLA=n CONFIG_BATMAN_ADV_DAT=y CONFIG_BATMAN_ADV_DEBUG=y CONFIG_BATMAN_ADV_NC=y
unused_symbols master linux-2.6.30 CONFIG_BATMAN_ADV_BLA=y CONFIG_BATMAN_ADV_DAT=n CONFIG_BATMAN_ADV_DEBUG=n CONFIG_BATMAN_ADV_NC=y
unused_symbols master linux-2.6.30 CONFIG_BATMAN_ADV_BLA=y CONFIG_BATMAN_ADV_DAT=y CONFIG_BATMAN_ADV_DEBUG=n CONFIG_BATMAN_ADV_NC=y
unused_symbols master linux-2.6.31 CONFIG_BATMAN_ADV_BLA=n CONFIG_BATMAN_ADV_DAT=y CONFIG_BATMAN_ADV_DEBUG=n CONFIG_BATMAN_ADV_NC=n
unused_symbols master linux-2.6.31 CONFIG_BATMAN_ADV_BLA=n CONFIG_BATMAN_ADV_DAT=y CONFIG_BATMAN_ADV_DEBUG=y CONFIG_BATMAN_ADV_NC=y
unused_symbols master linux-2.6.31 CONFIG_BATMAN_ADV_BLA=y CONFIG_BATMAN_ADV_DAT=n CONFIG_BATMAN_ADV_DEBUG=n CONFIG_BATMAN_ADV_NC=y
unused_symbols master linux-2.6.31 CONFIG_BATMAN_ADV_BLA=y CONFIG_BATMAN_ADV_DAT=y CONFIG_BATMAN_ADV_DEBUG=n CONFIG_BATMAN_ADV_NC=y
unused_symbols master linux-2.6.32 CONFIG_BATMAN_ADV_BLA=n CONFIG_BATMAN_ADV_DAT=y CONFIG_BATMAN_ADV_DEBUG=n CONFIG_BATMAN_ADV_NC=n
unused_symbols master linux-2.6.32 CONFIG_BATMAN_ADV_BLA=n CONFIG_BATMAN_ADV_DAT=y CONFIG_BATMAN_ADV_DEBUG=y CONFIG_BATMAN_ADV_NC=y
unused_symbols master linux-2.6.32 CONFIG_BATMAN_ADV_BLA=y CONFIG_BATMAN_ADV_DAT=n CONFIG_BATMAN_ADV_DEBUG=n CONFIG_BATMAN_ADV_NC=y
unused_symbols master linux-2.6.32 CONFIG_BATMAN_ADV_BLA=y CONFIG_BATMAN_ADV_DAT=y CONFIG_BATMAN_ADV_DEBUG=n CONFIG_BATMAN_ADV_NC=y
unused_symbols master linux-2.6.34 CONFIG_BATMAN_ADV_BLA=n CONFIG_BATMAN_ADV_DAT=y CONFIG_BATMAN_ADV_DEBUG=n CONFIG_BATMAN_ADV_NC=n
unused_symbols master linux-2.6.34 CONFIG_BATMAN_ADV_BLA=n CONFIG_BATMAN_ADV_DAT=y CONFIG_BATMAN_ADV_DEBUG=y CONFIG_BATMAN_ADV_NC=y
unused_symbols master linux-2.6.34 CONFIG_BATMAN_ADV_BLA=y CONFIG_BATMAN_ADV_DAT=n CONFIG_BATMAN_ADV_DEBUG=n CONFIG_BATMAN_ADV_NC=y
unused_symbols master linux-2.6.34 CONFIG_BATMAN_ADV_BLA=y CONFIG_BATMAN_ADV_DAT=y CONFIG_BATMAN_ADV_DEBUG=n CONFIG_BATMAN_ADV_NC=y
unused_symbols master linux-2.6.35 CONFIG_BATMAN_ADV_BLA=n CONFIG_BATMAN_ADV_DAT=y CONFIG_BATMAN_ADV_DEBUG=n CONFIG_BATMAN_ADV_NC=n
unused_symbols master linux-2.6.35 CONFIG_BATMAN_ADV_BLA=n CONFIG_BATMAN_ADV_DAT=y CONFIG_BATMAN_ADV_DEBUG=y CONFIG_BATMAN_ADV_NC=y
unused_symbols master linux-2.6.35 CONFIG_BATMAN_ADV_BLA=y CONFIG_BATMAN_ADV_DAT=n CONFIG_BATMAN_ADV_DEBUG=n CONFIG_BATMAN_ADV_NC=y
unused_symbols master linux-2.6.35 CONFIG_BATMAN_ADV_BLA=y CONFIG_BATMAN_ADV_DAT=y CONFIG_BATMAN_ADV_DEBUG=n CONFIG_BATMAN_ADV_NC=y
unused_symbols master linux-2.6.36 CONFIG_BATMAN_ADV_BLA=n CONFIG_BATMAN_ADV_DAT=y CONFIG_BATMAN_ADV_DEBUG=n CONFIG_BATMAN_ADV_NC=n
unused_symbols master linux-2.6.36 CONFIG_BATMAN_ADV_BLA=n CONFIG_BATMAN_ADV_DAT=y CONFIG_BATMAN_ADV_DEBUG=y CONFIG_BATMAN_ADV_NC=y
unused_symbols master linux-2.6.36 CONFIG_BATMAN_ADV_BLA=y CONFIG_BATMAN_ADV_DAT=n CONFIG_BATMAN_ADV_DEBUG=n CONFIG_BATMAN_ADV_NC=y
unused_symbols master linux-2.6.36 CONFIG_BATMAN_ADV_BLA=y CONFIG_BATMAN_ADV_DAT=y CONFIG_BATMAN_ADV_DEBUG=n CONFIG_BATMAN_ADV_NC=y
unused_symbols next linux-2.6.29 CONFIG_BATMAN_ADV_BLA=n CONFIG_BATMAN_ADV_DAT=n CONFIG_BATMAN_ADV_DEBUG=n CONFIG_BATMAN_ADV_NC=y
unused_symbols next linux-2.6.29 CONFIG_BATMAN_ADV_BLA=n CONFIG_BATMAN_ADV_DAT=y CONFIG_BATMAN_ADV_DEBUG=n CONFIG_BATMAN_ADV_NC=n
unused_symbols next linux-2.6.29 CONFIG_BATMAN_ADV_BLA=n CONFIG_BATMAN_ADV_DAT=y CONFIG_BATMAN_ADV_DEBUG=n CONFIG_BATMAN_ADV_NC=y
unused_symbols next linux-2.6.29 CONFIG_BATMAN_ADV_BLA=n CONFIG_BATMAN_ADV_DAT=y CONFIG_BATMAN_ADV_DEBUG=y CONFIG_BATMAN_ADV_NC=n
unused_symbols next linux-2.6.30 CONFIG_BATMAN_ADV_BLA=n CONFIG_BATMAN_ADV_DAT=n CONFIG_BATMAN_ADV_DEBUG=n CONFIG_BATMAN_ADV_NC=y
unused_symbols next linux-2.6.30 CONFIG_BATMAN_ADV_BLA=n CONFIG_BATMAN_ADV_DAT=y CONFIG_BATMAN_ADV_DEBUG=n CONFIG_BATMAN_ADV_NC=n
unused_symbols next linux-2.6.30 CONFIG_BATMAN_ADV_BLA=n CONFIG_BATMAN_ADV_DAT=y CONFIG_BATMAN_ADV_DEBUG=n CONFIG_BATMAN_ADV_NC=y
unused_symbols next linux-2.6.30 CONFIG_BATMAN_ADV_BLA=n CONFIG_BATMAN_ADV_DAT=y CONFIG_BATMAN_ADV_DEBUG=y CONFIG_BATMAN_ADV_NC=n
unused_symbols next linux-2.6.31 CONFIG_BATMAN_ADV_BLA=n CONFIG_BATMAN_ADV_DAT=n CONFIG_BATMAN_ADV_DEBUG=n CONFIG_BATMAN_ADV_NC=y
unused_symbols next linux-2.6.31 CONFIG_BATMAN_ADV_BLA=n CONFIG_BATMAN_ADV_DAT=y CONFIG_BATMAN_ADV_DEBUG=n CONFIG_BATMAN_ADV_NC=n
unused_symbols next linux-2.6.31 CONFIG_BATMAN_ADV_BLA=n CONFIG_BATMAN_ADV_DAT=y CONFIG_BATMAN_ADV_DEBUG=n CONFIG_BATMAN_ADV_NC=y
unused_symbols next linux-2.6.31 CONFIG_BATMAN_ADV_BLA=n CONFIG_BATMAN_ADV_DAT=y CONFIG_BATMAN_ADV_DEBUG=y CONFIG_BATMAN_ADV_NC=n
unused_symbols next linux-2.6.32 CONFIG_BATMAN_ADV_BLA=n CONFIG_BATMAN_ADV_DAT=n CONFIG_BATMAN_ADV_DEBUG=n CONFIG_BATMAN_ADV_NC=y
unused_symbols next linux-2.6.32 CONFIG_BATMAN_ADV_BLA=n CONFIG_BATMAN_ADV_DAT=y CONFIG_BATMAN_ADV_DEBUG=n CONFIG_BATMAN_ADV_NC=n
unused_symbols next linux-2.6.32 CONFIG_BATMAN_ADV_BLA=n CONFIG_BATMAN_ADV_DAT=y CONFIG_BATMAN_ADV_DEBUG=n CONFIG_BATMAN_ADV_NC=y
unused_symbols next linux-2.6.32 CONFIG_BATMAN_ADV_BLA=n CONFIG_BATMAN_ADV_DAT=y CONFIG_BATMAN_ADV_DEBUG=y CONFIG_BATMAN_ADV_NC=n
unused_symbols next linux-2.6.34 CONFIG_BATMAN_ADV_BLA=n CONFIG_BATMAN_ADV_DAT=n CONFIG_BATMAN_ADV_DEBUG=n CONFIG_BATMAN_ADV_NC=y
unused_symbols next linux-2.6.34 CONFIG_BATMAN_ADV_BLA=n CONFIG_BATMAN_ADV_DAT=y CONFIG_BATMAN_ADV_DEBUG=n CONFIG_BATMAN_ADV_NC=n
unused_symbols next linux-2.6.34 CONFIG_BATMAN_ADV_BLA=n CONFIG_BATMAN_ADV_DAT=y CONFIG_BATMAN_ADV_DEBUG=n CONFIG_BATMAN_ADV_NC=y
unused_symbols next linux-2.6.34 CONFIG_BATMAN_ADV_BLA=n CONFIG_BATMAN_ADV_DAT=y CONFIG_BATMAN_ADV_DEBUG=y CONFIG_BATMAN_ADV_NC=n
unused_symbols next linux-2.6.35 CONFIG_BATMAN_ADV_BLA=n CONFIG_BATMAN_ADV_DAT=n CONFIG_BATMAN_ADV_DEBUG=n CONFIG_BATMAN_ADV_NC=y
unused_symbols next linux-2.6.35 CONFIG_BATMAN_ADV_BLA=n CONFIG_BATMAN_ADV_DAT=y CONFIG_BATMAN_ADV_DEBUG=n CONFIG_BATMAN_ADV_NC=n
unused_symbols next linux-2.6.35 CONFIG_BATMAN_ADV_BLA=n CONFIG_BATMAN_ADV_DAT=y CONFIG_BATMAN_ADV_DEBUG=n CONFIG_BATMAN_ADV_NC=y
unused_symbols next linux-2.6.35 CONFIG_BATMAN_ADV_BLA=n CONFIG_BATMAN_ADV_DAT=y CONFIG_BATMAN_ADV_DEBUG=y CONFIG_BATMAN_ADV_NC=n
unused_symbols next linux-2.6.36 CONFIG_BATMAN_ADV_BLA=n CONFIG_BATMAN_ADV_DAT=n CONFIG_BATMAN_ADV_DEBUG=n CONFIG_BATMAN_ADV_NC=y
unused_symbols next linux-2.6.36 CONFIG_BATMAN_ADV_BLA=n CONFIG_BATMAN_ADV_DAT=y CONFIG_BATMAN_ADV_DEBUG=n CONFIG_BATMAN_ADV_NC=n
unused_symbols next linux-2.6.36 CONFIG_BATMAN_ADV_BLA=n CONFIG_BATMAN_ADV_DAT=y CONFIG_BATMAN_ADV_DEBUG=n CONFIG_BATMAN_ADV_NC=y
unused_symbols next linux-2.6.36 CONFIG_BATMAN_ADV_BLA=n CONFIG_BATMAN_ADV_DAT=y CONFIG_BATMAN_ADV_DEBUG=y CONFIG_BATMAN_ADV_NC=n

Output of different failed tests
================================

cppcheck next:
>>>>>>>>
[gateway_client.c:181]: (style) Variable 'max_gw_factor' is assigned a value that is never used
[gateway_client.c:178]: (style) Variable 'max_tq' is assigned a value that is never used
[translation-table.c:944]: (style) Variable 'best_tq' is assigned a value that is never used

sparse next linux-2.6.32 CONFIG_BATMAN_ADV_BLA=n CONFIG_BATMAN_ADV_DAT=n CONFIG_BATMAN_ADV_DEBUG=n CONFIG_BATMAN_ADV_NC=y:
>>>>>>>>
/home/batman/build_test/tmp/bat_iv_ogm.c:667:9: error: undefined identifier 'rcu_dereference_raw'
/home/batman/build_test/tmp/bat_iv_ogm.c:667:9: error: undefined identifier 'rcu_dereference_raw'
/home/batman/build_test/tmp/bat_iv_ogm.c:811:9: error: undefined identifier 'rcu_dereference_raw'
/home/batman/build_test/tmp/bat_iv_ogm.c:811:9: error: undefined identifier 'rcu_dereference_raw'
/home/batman/build_test/tmp/bat_iv_ogm.c:943:9: error: undefined identifier 'rcu_dereference_raw'
/home/batman/build_test/tmp/bat_iv_ogm.c:943:9: error: undefined identifier 'rcu_dereference_raw'
In file included from /home/batman/build_test/tmp/bat_iv_ogm.c:23:0:
/home/batman/build_test/tmp/originator.h: In function 'batadv_orig_hash_find':
/home/batman/build_test/tmp/originator.h:81:2: error: implicit declaration of function 'rcu_dereference_raw' [-Werror=implicit-function-declaration]
/home/batman/build_test/tmp/originator.h:81:2: error: implicit declaration of function 'hlist_first_rcu' [-Werror=implicit-function-declaration]
/home/batman/build_test/tmp/originator.h:81:2: warning: initialization makes pointer from integer without a cast [enabled by default]
/home/batman/build_test/tmp/originator.h:81:2: error: implicit declaration of function 'hlist_next_rcu' [-Werror=implicit-function-declaration]
/home/batman/build_test/tmp/originator.h:81:2: warning: initialization makes pointer from integer without a cast [enabled by default]
/home/batman/build_test/tmp/bat_iv_ogm.c: In function 'batadv_iv_ogm_orig_update':
/home/batman/build_test/tmp/bat_iv_ogm.c:667:2: warning: initialization makes pointer from integer without a cast [enabled by default]
/home/batman/build_test/tmp/bat_iv_ogm.c:667:2: warning: initialization makes pointer from integer without a cast [enabled by default]
/home/batman/build_test/tmp/bat_iv_ogm.c: In function 'batadv_iv_ogm_calc_tq':
/home/batman/build_test/tmp/bat_iv_ogm.c:811:2: warning: initialization makes pointer from integer without a cast [enabled by default]
/home/batman/build_test/tmp/bat_iv_ogm.c:811:2: warning: initialization makes pointer from integer without a cast [enabled by default]
/home/batman/build_test/tmp/bat_iv_ogm.c: In function 'batadv_iv_ogm_update_seqnos':
/home/batman/build_test/tmp/bat_iv_ogm.c:943:2: warning: initialization makes pointer from integer without a cast [enabled by default]
/home/batman/build_test/tmp/bat_iv_ogm.c:943:2: warning: initialization makes pointer from integer without a cast [enabled by default]
cc1: some warnings being treated as errors
make[2]: *** [/home/batman/build_test/tmp/bat_iv_ogm.o] Error 1
make[1]: *** [_module_/home/batman/build_test/tmp] Error 2
make: *** [all] Error 2

sparse next linux-2.6.36 CONFIG_BATMAN_ADV_BLA=n CONFIG_BATMAN_ADV_DAT=n CONFIG_BATMAN_ADV_DEBUG=n CONFIG_BATMAN_ADV_NC=y:
>>>>>>>>
/home/batman/build_test/tmp/bat_iv_ogm.c:667:9: error: undefined identifier 'hlist_first_rcu'
/home/batman/build_test/tmp/bat_iv_ogm.c:667:9: error: not a function <noident>
/home/batman/build_test/tmp/bat_iv_ogm.c:667:9: error: undefined identifier 'hlist_first_rcu'
/home/batman/build_test/tmp/bat_iv_ogm.c:667:9: error: cast from unknown type
/home/batman/build_test/tmp/bat_iv_ogm.c:667:9: error: cannot dereference this type
/home/batman/build_test/tmp/bat_iv_ogm.c:667:9: error: undefined identifier 'hlist_first_rcu'
/home/batman/build_test/tmp/bat_iv_ogm.c:667:9: error: not a function <noident>
/home/batman/build_test/tmp/bat_iv_ogm.c:667:9: error: undefined identifier 'hlist_first_rcu'
/home/batman/build_test/tmp/bat_iv_ogm.c:667:9: error: cast from unknown type
/home/batman/build_test/tmp/bat_iv_ogm.c:667:9: error: cannot dereference this type
/home/batman/build_test/tmp/bat_iv_ogm.c:667:9: error: undefined identifier 'hlist_next_rcu'
/home/batman/build_test/tmp/bat_iv_ogm.c:667:9: error: not a function <noident>
/home/batman/build_test/tmp/bat_iv_ogm.c:667:9: error: undefined identifier 'hlist_next_rcu'
/home/batman/build_test/tmp/bat_iv_ogm.c:667:9: error: cast from unknown type
/home/batman/build_test/tmp/bat_iv_ogm.c:667:9: error: cannot dereference this type
/home/batman/build_test/tmp/bat_iv_ogm.c:667:9: error: undefined identifier 'hlist_next_rcu'
/home/batman/build_test/tmp/bat_iv_ogm.c:667:9: error: not a function <noident>
/home/batman/build_test/tmp/bat_iv_ogm.c:667:9: error: undefined identifier 'hlist_next_rcu'
/home/batman/build_test/tmp/bat_iv_ogm.c:667:9: error: cast from unknown type
/home/batman/build_test/tmp/bat_iv_ogm.c:667:9: error: cannot dereference this type
/home/batman/build_test/tmp/bat_iv_ogm.c:811:9: error: undefined identifier 'hlist_first_rcu'
/home/batman/build_test/tmp/bat_iv_ogm.c:811:9: error: not a function <noident>
/home/batman/build_test/tmp/bat_iv_ogm.c:811:9: error: undefined identifier 'hlist_first_rcu'
/home/batman/build_test/tmp/bat_iv_ogm.c:811:9: error: cast from unknown type
/home/batman/build_test/tmp/bat_iv_ogm.c:811:9: error: cannot dereference this type
/home/batman/build_test/tmp/bat_iv_ogm.c:811:9: error: undefined identifier 'hlist_first_rcu'
/home/batman/build_test/tmp/bat_iv_ogm.c:811:9: error: not a function <noident>
/home/batman/build_test/tmp/bat_iv_ogm.c:811:9: error: undefined identifier 'hlist_first_rcu'
/home/batman/build_test/tmp/bat_iv_ogm.c:811:9: error: cast from unknown type
/home/batman/build_test/tmp/bat_iv_ogm.c:811:9: error: cannot dereference this type
/home/batman/build_test/tmp/bat_iv_ogm.c:811:9: error: undefined identifier 'hlist_next_rcu'
/home/batman/build_test/tmp/bat_iv_ogm.c:811:9: error: not a function <noident>
/home/batman/build_test/tmp/bat_iv_ogm.c:811:9: error: undefined identifier 'hlist_next_rcu'
/home/batman/build_test/tmp/bat_iv_ogm.c:811:9: error: cast from unknown type
/home/batman/build_test/tmp/bat_iv_ogm.c:811:9: error: cannot dereference this type
/home/batman/build_test/tmp/bat_iv_ogm.c:811:9: error: undefined identifier 'hlist_next_rcu'
/home/batman/build_test/tmp/bat_iv_ogm.c:811:9: error: not a function <noident>
/home/batman/build_test/tmp/bat_iv_ogm.c:811:9: error: undefined identifier 'hlist_next_rcu'
/home/batman/build_test/tmp/bat_iv_ogm.c:811:9: error: cast from unknown type
/home/batman/build_test/tmp/bat_iv_ogm.c:811:9: error: cannot dereference this type
/home/batman/build_test/tmp/bat_iv_ogm.c:943:9: error: undefined identifier 'hlist_first_rcu'
/home/batman/build_test/tmp/bat_iv_ogm.c:943:9: error: not a function <noident>
/home/batman/build_test/tmp/bat_iv_ogm.c:943:9: error: undefined identifier 'hlist_first_rcu'
/home/batman/build_test/tmp/bat_iv_ogm.c:943:9: error: cast from unknown type
/home/batman/build_test/tmp/bat_iv_ogm.c:943:9: error: cannot dereference this type
/home/batman/build_test/tmp/bat_iv_ogm.c:943:9: error: undefined identifier 'hlist_first_rcu'
/home/batman/build_test/tmp/bat_iv_ogm.c:943:9: error: not a function <noident>
/home/batman/build_test/tmp/bat_iv_ogm.c:943:9: error: undefined identifier 'hlist_first_rcu'
/home/batman/build_test/tmp/bat_iv_ogm.c:943:9: error: cast from unknown type
/home/batman/build_test/tmp/bat_iv_ogm.c:943:9: error: cannot dereference this type
/home/batman/build_test/tmp/bat_iv_ogm.c:943:9: error: undefined identifier 'hlist_next_rcu'
/home/batman/build_test/tmp/bat_iv_ogm.c:943:9: error: not a function <noident>
/home/batman/build_test/tmp/bat_iv_ogm.c:943:9: error: undefined identifier 'hlist_next_rcu'
/home/batman/build_test/tmp/bat_iv_ogm.c:943:9: error: cast from unknown type
/home/batman/build_test/tmp/bat_iv_ogm.c:943:9: error: cannot dereference this type
/home/batman/build_test/tmp/bat_iv_ogm.c:943:9: error: undefined identifier 'hlist_next_rcu'
/home/batman/build_test/tmp/bat_iv_ogm.c:943:9: error: not a function <noident>
/home/batman/build_test/tmp/bat_iv_ogm.c:943:9: error: undefined identifier 'hlist_next_rcu'
/home/batman/build_test/tmp/bat_iv_ogm.c:943:9: error: cast from unknown type
/home/batman/build_test/tmp/bat_iv_ogm.c:943:9: error: cannot dereference this type
In file included from /home/batman/build_test/tmp/bat_iv_ogm.c:23:0:
/home/batman/build_test/tmp/originator.h: In function 'batadv_orig_hash_find':
/home/batman/build_test/tmp/originator.h:81:2: error: implicit declaration of function 'hlist_first_rcu' [-Werror=implicit-function-declaration]
/home/batman/build_test/tmp/originator.h:81:2: error: lvalue required as unary '&' operand
/home/batman/build_test/tmp/originator.h:81:2: error: lvalue required as unary '&' operand
/home/batman/build_test/tmp/originator.h:81:2: warning: initialization makes pointer from integer without a cast [enabled by default]
/home/batman/build_test/tmp/originator.h:81:2: error: implicit declaration of function 'hlist_next_rcu' [-Werror=implicit-function-declaration]
/home/batman/build_test/tmp/originator.h:81:2: error: lvalue required as unary '&' operand
/home/batman/build_test/tmp/originator.h:81:2: error: lvalue required as unary '&' operand
/home/batman/build_test/tmp/originator.h:81:2: warning: initialization makes pointer from integer without a cast [enabled by default]
/home/batman/build_test/tmp/bat_iv_ogm.c: In function 'batadv_iv_ogm_orig_update':
/home/batman/build_test/tmp/bat_iv_ogm.c:667:2: error: lvalue required as unary '&' operand
/home/batman/build_test/tmp/bat_iv_ogm.c:667:2: error: lvalue required as unary '&' operand
/home/batman/build_test/tmp/bat_iv_ogm.c:667:2: warning: initialization makes pointer from integer without a cast [enabled by default]
/home/batman/build_test/tmp/bat_iv_ogm.c:667:2: error: lvalue required as unary '&' operand
/home/batman/build_test/tmp/bat_iv_ogm.c:667:2: error: lvalue required as unary '&' operand
/home/batman/build_test/tmp/bat_iv_ogm.c:667:2: warning: initialization makes pointer from integer without a cast [enabled by default]
/home/batman/build_test/tmp/bat_iv_ogm.c: In function 'batadv_iv_ogm_calc_tq':
/home/batman/build_test/tmp/bat_iv_ogm.c:811:2: error: lvalue required as unary '&' operand
/home/batman/build_test/tmp/bat_iv_ogm.c:811:2: error: lvalue required as unary '&' operand
/home/batman/build_test/tmp/bat_iv_ogm.c:811:2: warning: initialization makes pointer from integer without a cast [enabled by default]
/home/batman/build_test/tmp/bat_iv_ogm.c:811:2: error: lvalue required as unary '&' operand
/home/batman/build_test/tmp/bat_iv_ogm.c:811:2: error: lvalue required as unary '&' operand
/home/batman/build_test/tmp/bat_iv_ogm.c:811:2: warning: initialization makes pointer from integer without a cast [enabled by default]
/home/batman/build_test/tmp/bat_iv_ogm.c: In function 'batadv_iv_ogm_update_seqnos':
/home/batman/build_test/tmp/bat_iv_ogm.c:943:2: error: lvalue required as unary '&' operand
/home/batman/build_test/tmp/bat_iv_ogm.c:943:2: error: lvalue required as unary '&' operand
/home/batman/build_test/tmp/bat_iv_ogm.c:943:2: warning: initialization makes pointer from integer without a cast [enabled by default]
/home/batman/build_test/tmp/bat_iv_ogm.c:943:2: error: lvalue required as unary '&' operand
/home/batman/build_test/tmp/bat_iv_ogm.c:943:2: error: lvalue required as unary '&' operand
/home/batman/build_test/tmp/bat_iv_ogm.c:943:2: warning: initialization makes pointer from integer without a cast [enabled by default]
cc1: some warnings being treated as errors
make[2]: *** [/home/batman/build_test/tmp/bat_iv_ogm.o] Error 1
make[1]: *** [_module_/home/batman/build_test/tmp] Error 2
make: *** [all] Error 2

unused_symbols master linux-2.6.36 CONFIG_BATMAN_ADV_BLA=y CONFIG_BATMAN_ADV_DAT=n CONFIG_BATMAN_ADV_DEBUG=n CONFIG_BATMAN_ADV_NC=y:
>>>>>>>>
batadv_free_rcu_backbone_gw
batadv_free_rcu_gw_node
batadv_free_rcu_nc_path
batadv_free_rcu_neigh_node
batadv_free_rcu_tt_local_entry

unused_symbols master linux-2.6.36 CONFIG_BATMAN_ADV_BLA=y CONFIG_BATMAN_ADV_DAT=y CONFIG_BATMAN_ADV_DEBUG=n CONFIG_BATMAN_ADV_NC=y:
>>>>>>>>
batadv_free_rcu_backbone_gw
batadv_free_rcu_dat_entry
batadv_free_rcu_gw_node
batadv_free_rcu_nc_path
batadv_free_rcu_neigh_node
batadv_free_rcu_tt_local_entry

unused_symbols next linux-2.6.36 CONFIG_BATMAN_ADV_BLA=n CONFIG_BATMAN_ADV_DAT=n CONFIG_BATMAN_ADV_DEBUG=n CONFIG_BATMAN_ADV_NC=y:
>>>>>>>>
batadv_free_rcu_gw_node
batadv_free_rcu_nc_path
batadv_free_rcu_neigh_node
batadv_free_rcu_tt_local_entry

unused_symbols next linux-2.6.36 CONFIG_BATMAN_ADV_BLA=n CONFIG_BATMAN_ADV_DAT=y CONFIG_BATMAN_ADV_DEBUG=n CONFIG_BATMAN_ADV_NC=n:
>>>>>>>>
batadv_free_rcu_dat_entry
batadv_free_rcu_gw_node
batadv_free_rcu_neigh_node
batadv_free_rcu_tt_local_entry

unused_symbols next linux-2.6.36 CONFIG_BATMAN_ADV_BLA=n CONFIG_BATMAN_ADV_DAT=y CONFIG_BATMAN_ADV_DEBUG=n CONFIG_BATMAN_ADV_NC=y:
>>>>>>>>
batadv_free_rcu_dat_entry
batadv_free_rcu_gw_node
batadv_free_rcu_nc_path
batadv_free_rcu_neigh_node
batadv_free_rcu_tt_local_entry



More information about the linux-merge mailing list