Build check errors found: 2013-02-25

postmaster at open-mesh.org postmaster at open-mesh.org
Mon Feb 25 00:58:49 CET 2013


Name of failed tests
====================

sparse master linux-2.6.29 CONFIG_BATMAN_ADV_BLA=n CONFIG_BATMAN_ADV_DAT=y CONFIG_BATMAN_ADV_DEBUG=y CONFIG_BATMAN_ADV_NC=y
sparse master linux-2.6.29 CONFIG_BATMAN_ADV_BLA=y CONFIG_BATMAN_ADV_DAT=y CONFIG_BATMAN_ADV_DEBUG=n CONFIG_BATMAN_ADV_NC=n
sparse master linux-2.6.29 CONFIG_BATMAN_ADV_BLA=y CONFIG_BATMAN_ADV_DAT=y CONFIG_BATMAN_ADV_DEBUG=y CONFIG_BATMAN_ADV_NC=n
sparse master linux-2.6.30 CONFIG_BATMAN_ADV_BLA=n CONFIG_BATMAN_ADV_DAT=y CONFIG_BATMAN_ADV_DEBUG=y CONFIG_BATMAN_ADV_NC=y
sparse master linux-2.6.30 CONFIG_BATMAN_ADV_BLA=y CONFIG_BATMAN_ADV_DAT=y CONFIG_BATMAN_ADV_DEBUG=n CONFIG_BATMAN_ADV_NC=n
sparse master linux-2.6.30 CONFIG_BATMAN_ADV_BLA=y CONFIG_BATMAN_ADV_DAT=y CONFIG_BATMAN_ADV_DEBUG=y CONFIG_BATMAN_ADV_NC=n
sparse master linux-2.6.31 CONFIG_BATMAN_ADV_BLA=n CONFIG_BATMAN_ADV_DAT=y CONFIG_BATMAN_ADV_DEBUG=y CONFIG_BATMAN_ADV_NC=y
sparse master linux-2.6.31 CONFIG_BATMAN_ADV_BLA=y CONFIG_BATMAN_ADV_DAT=y CONFIG_BATMAN_ADV_DEBUG=n CONFIG_BATMAN_ADV_NC=n
sparse master linux-2.6.31 CONFIG_BATMAN_ADV_BLA=y CONFIG_BATMAN_ADV_DAT=y CONFIG_BATMAN_ADV_DEBUG=y CONFIG_BATMAN_ADV_NC=n
sparse master linux-2.6.32 CONFIG_BATMAN_ADV_BLA=n CONFIG_BATMAN_ADV_DAT=y CONFIG_BATMAN_ADV_DEBUG=y CONFIG_BATMAN_ADV_NC=y
sparse master linux-2.6.32 CONFIG_BATMAN_ADV_BLA=y CONFIG_BATMAN_ADV_DAT=y CONFIG_BATMAN_ADV_DEBUG=n CONFIG_BATMAN_ADV_NC=n
sparse master linux-2.6.32 CONFIG_BATMAN_ADV_BLA=y CONFIG_BATMAN_ADV_DAT=y CONFIG_BATMAN_ADV_DEBUG=y CONFIG_BATMAN_ADV_NC=n
sparse master linux-2.6.34 CONFIG_BATMAN_ADV_BLA=n CONFIG_BATMAN_ADV_DAT=y CONFIG_BATMAN_ADV_DEBUG=y CONFIG_BATMAN_ADV_NC=y
sparse master linux-2.6.34 CONFIG_BATMAN_ADV_BLA=y CONFIG_BATMAN_ADV_DAT=y CONFIG_BATMAN_ADV_DEBUG=n CONFIG_BATMAN_ADV_NC=n
sparse master linux-2.6.34 CONFIG_BATMAN_ADV_BLA=y CONFIG_BATMAN_ADV_DAT=y CONFIG_BATMAN_ADV_DEBUG=y CONFIG_BATMAN_ADV_NC=n
sparse master linux-2.6.35 CONFIG_BATMAN_ADV_BLA=n CONFIG_BATMAN_ADV_DAT=y CONFIG_BATMAN_ADV_DEBUG=y CONFIG_BATMAN_ADV_NC=y
sparse master linux-2.6.35 CONFIG_BATMAN_ADV_BLA=y CONFIG_BATMAN_ADV_DAT=y CONFIG_BATMAN_ADV_DEBUG=n CONFIG_BATMAN_ADV_NC=n
sparse master linux-2.6.35 CONFIG_BATMAN_ADV_BLA=y CONFIG_BATMAN_ADV_DAT=y CONFIG_BATMAN_ADV_DEBUG=y CONFIG_BATMAN_ADV_NC=n
sparse master linux-2.6.36 CONFIG_BATMAN_ADV_BLA=n CONFIG_BATMAN_ADV_DAT=y CONFIG_BATMAN_ADV_DEBUG=y CONFIG_BATMAN_ADV_NC=y
sparse master linux-2.6.36 CONFIG_BATMAN_ADV_BLA=y CONFIG_BATMAN_ADV_DAT=y CONFIG_BATMAN_ADV_DEBUG=n CONFIG_BATMAN_ADV_NC=n
sparse master linux-2.6.36 CONFIG_BATMAN_ADV_BLA=y CONFIG_BATMAN_ADV_DAT=y CONFIG_BATMAN_ADV_DEBUG=y CONFIG_BATMAN_ADV_NC=n
sparse master linux-2.6.37 CONFIG_BATMAN_ADV_BLA=n CONFIG_BATMAN_ADV_DAT=y CONFIG_BATMAN_ADV_DEBUG=y CONFIG_BATMAN_ADV_NC=y
sparse master linux-2.6.37 CONFIG_BATMAN_ADV_BLA=y CONFIG_BATMAN_ADV_DAT=y CONFIG_BATMAN_ADV_DEBUG=n CONFIG_BATMAN_ADV_NC=n
sparse master linux-2.6.37 CONFIG_BATMAN_ADV_BLA=y CONFIG_BATMAN_ADV_DAT=y CONFIG_BATMAN_ADV_DEBUG=y CONFIG_BATMAN_ADV_NC=n
sparse master linux-2.6.38 CONFIG_BATMAN_ADV_BLA=n CONFIG_BATMAN_ADV_DAT=y CONFIG_BATMAN_ADV_DEBUG=y CONFIG_BATMAN_ADV_NC=y
sparse master linux-2.6.38 CONFIG_BATMAN_ADV_BLA=y CONFIG_BATMAN_ADV_DAT=y CONFIG_BATMAN_ADV_DEBUG=n CONFIG_BATMAN_ADV_NC=n
sparse master linux-2.6.38 CONFIG_BATMAN_ADV_BLA=y CONFIG_BATMAN_ADV_DAT=y CONFIG_BATMAN_ADV_DEBUG=y CONFIG_BATMAN_ADV_NC=n
unused_symbols master linux-2.6.29 CONFIG_BATMAN_ADV_BLA=n CONFIG_BATMAN_ADV_DAT=y CONFIG_BATMAN_ADV_DEBUG=y CONFIG_BATMAN_ADV_NC=y
unused_symbols master linux-2.6.29 CONFIG_BATMAN_ADV_BLA=y CONFIG_BATMAN_ADV_DAT=y CONFIG_BATMAN_ADV_DEBUG=n CONFIG_BATMAN_ADV_NC=n
unused_symbols master linux-2.6.29 CONFIG_BATMAN_ADV_BLA=y CONFIG_BATMAN_ADV_DAT=y CONFIG_BATMAN_ADV_DEBUG=y CONFIG_BATMAN_ADV_NC=n
unused_symbols master linux-2.6.30 CONFIG_BATMAN_ADV_BLA=n CONFIG_BATMAN_ADV_DAT=y CONFIG_BATMAN_ADV_DEBUG=y CONFIG_BATMAN_ADV_NC=y
unused_symbols master linux-2.6.30 CONFIG_BATMAN_ADV_BLA=y CONFIG_BATMAN_ADV_DAT=y CONFIG_BATMAN_ADV_DEBUG=n CONFIG_BATMAN_ADV_NC=n
unused_symbols master linux-2.6.30 CONFIG_BATMAN_ADV_BLA=y CONFIG_BATMAN_ADV_DAT=y CONFIG_BATMAN_ADV_DEBUG=y CONFIG_BATMAN_ADV_NC=n
unused_symbols master linux-2.6.31 CONFIG_BATMAN_ADV_BLA=n CONFIG_BATMAN_ADV_DAT=y CONFIG_BATMAN_ADV_DEBUG=y CONFIG_BATMAN_ADV_NC=y
unused_symbols master linux-2.6.31 CONFIG_BATMAN_ADV_BLA=y CONFIG_BATMAN_ADV_DAT=y CONFIG_BATMAN_ADV_DEBUG=n CONFIG_BATMAN_ADV_NC=n
unused_symbols master linux-2.6.31 CONFIG_BATMAN_ADV_BLA=y CONFIG_BATMAN_ADV_DAT=y CONFIG_BATMAN_ADV_DEBUG=y CONFIG_BATMAN_ADV_NC=n
unused_symbols master linux-2.6.32 CONFIG_BATMAN_ADV_BLA=n CONFIG_BATMAN_ADV_DAT=y CONFIG_BATMAN_ADV_DEBUG=y CONFIG_BATMAN_ADV_NC=y
unused_symbols master linux-2.6.32 CONFIG_BATMAN_ADV_BLA=y CONFIG_BATMAN_ADV_DAT=y CONFIG_BATMAN_ADV_DEBUG=n CONFIG_BATMAN_ADV_NC=n
unused_symbols master linux-2.6.32 CONFIG_BATMAN_ADV_BLA=y CONFIG_BATMAN_ADV_DAT=y CONFIG_BATMAN_ADV_DEBUG=y CONFIG_BATMAN_ADV_NC=n
unused_symbols master linux-2.6.34 CONFIG_BATMAN_ADV_BLA=n CONFIG_BATMAN_ADV_DAT=y CONFIG_BATMAN_ADV_DEBUG=y CONFIG_BATMAN_ADV_NC=y
unused_symbols master linux-2.6.34 CONFIG_BATMAN_ADV_BLA=y CONFIG_BATMAN_ADV_DAT=y CONFIG_BATMAN_ADV_DEBUG=n CONFIG_BATMAN_ADV_NC=n
unused_symbols master linux-2.6.34 CONFIG_BATMAN_ADV_BLA=y CONFIG_BATMAN_ADV_DAT=y CONFIG_BATMAN_ADV_DEBUG=y CONFIG_BATMAN_ADV_NC=n
unused_symbols master linux-2.6.35 CONFIG_BATMAN_ADV_BLA=n CONFIG_BATMAN_ADV_DAT=y CONFIG_BATMAN_ADV_DEBUG=y CONFIG_BATMAN_ADV_NC=y
unused_symbols master linux-2.6.35 CONFIG_BATMAN_ADV_BLA=y CONFIG_BATMAN_ADV_DAT=y CONFIG_BATMAN_ADV_DEBUG=n CONFIG_BATMAN_ADV_NC=n
unused_symbols master linux-2.6.35 CONFIG_BATMAN_ADV_BLA=y CONFIG_BATMAN_ADV_DAT=y CONFIG_BATMAN_ADV_DEBUG=y CONFIG_BATMAN_ADV_NC=n
unused_symbols master linux-2.6.36 CONFIG_BATMAN_ADV_BLA=n CONFIG_BATMAN_ADV_DAT=y CONFIG_BATMAN_ADV_DEBUG=y CONFIG_BATMAN_ADV_NC=y
unused_symbols master linux-2.6.36 CONFIG_BATMAN_ADV_BLA=y CONFIG_BATMAN_ADV_DAT=y CONFIG_BATMAN_ADV_DEBUG=n CONFIG_BATMAN_ADV_NC=n
unused_symbols master linux-2.6.36 CONFIG_BATMAN_ADV_BLA=y CONFIG_BATMAN_ADV_DAT=y CONFIG_BATMAN_ADV_DEBUG=y CONFIG_BATMAN_ADV_NC=n
unused_symbols master linux-2.6.37 CONFIG_BATMAN_ADV_BLA=n CONFIG_BATMAN_ADV_DAT=y CONFIG_BATMAN_ADV_DEBUG=y CONFIG_BATMAN_ADV_NC=y
unused_symbols master linux-2.6.37 CONFIG_BATMAN_ADV_BLA=y CONFIG_BATMAN_ADV_DAT=y CONFIG_BATMAN_ADV_DEBUG=n CONFIG_BATMAN_ADV_NC=n
unused_symbols master linux-2.6.37 CONFIG_BATMAN_ADV_BLA=y CONFIG_BATMAN_ADV_DAT=y CONFIG_BATMAN_ADV_DEBUG=y CONFIG_BATMAN_ADV_NC=n
unused_symbols master linux-2.6.38 CONFIG_BATMAN_ADV_BLA=n CONFIG_BATMAN_ADV_DAT=y CONFIG_BATMAN_ADV_DEBUG=y CONFIG_BATMAN_ADV_NC=y
unused_symbols master linux-2.6.38 CONFIG_BATMAN_ADV_BLA=y CONFIG_BATMAN_ADV_DAT=y CONFIG_BATMAN_ADV_DEBUG=n CONFIG_BATMAN_ADV_NC=n
unused_symbols master linux-2.6.38 CONFIG_BATMAN_ADV_BLA=y CONFIG_BATMAN_ADV_DAT=y CONFIG_BATMAN_ADV_DEBUG=y CONFIG_BATMAN_ADV_NC=n

Output of different failed tests
================================

sparse master linux-2.6.32 CONFIG_BATMAN_ADV_BLA=n CONFIG_BATMAN_ADV_DAT=y CONFIG_BATMAN_ADV_DEBUG=y CONFIG_BATMAN_ADV_NC=y:
>>>>>>>>
/home/batman/build_test/tmp/soft-interface.c:573:10: error: unknown field name in initializer
/home/batman/build_test/tmp/soft-interface.c:574:10: error: unknown field name in initializer
/home/batman/build_test/tmp/soft-interface.c:668:9: error: undefined identifier 'unregister_netdevice_queue'
/home/batman/build_test/tmp/soft-interface.c:573:2: error: unknown field 'ndo_add_slave' specified in initializer
/home/batman/build_test/tmp/soft-interface.c:573:2: warning: initialization from incompatible pointer type [enabled by default]
/home/batman/build_test/tmp/soft-interface.c:573:2: warning: (near initialization for 'batadv_netdev_ops.ndo_do_ioctl') [enabled by default]
/home/batman/build_test/tmp/soft-interface.c:574:2: error: unknown field 'ndo_del_slave' specified in initializer
/home/batman/build_test/tmp/soft-interface.c:574:2: warning: initialization from incompatible pointer type [enabled by default]
/home/batman/build_test/tmp/soft-interface.c:574:2: warning: (near initialization for 'batadv_netdev_ops.ndo_set_config') [enabled by default]
/home/batman/build_test/tmp/soft-interface.c: In function 'batadv_softif_destroy_netlink':
/home/batman/build_test/tmp/soft-interface.c:668:2: error: implicit declaration of function 'unregister_netdevice_queue' [-Werror=implicit-function-declaration]
/home/batman/build_test/tmp/soft-interface.c: At top level:
/home/batman/build_test/tmp/soft-interface.c:683:2: warning: initialization from incompatible pointer type [enabled by default]
/home/batman/build_test/tmp/soft-interface.c:683:2: warning: (near initialization for 'batadv_link_ops.dellink') [enabled by default]
cc1: some warnings being treated as errors
make[2]: *** [/home/batman/build_test/tmp/soft-interface.o] Error 1
make[1]: *** [_module_/home/batman/build_test/tmp] Error 2
make: *** [all] Error 2

sparse master linux-2.6.38 CONFIG_BATMAN_ADV_BLA=n CONFIG_BATMAN_ADV_DAT=y CONFIG_BATMAN_ADV_DEBUG=y CONFIG_BATMAN_ADV_NC=y:
>>>>>>>>
/home/batman/build_test/tmp/soft-interface.c:573:10: error: unknown field name in initializer
/home/batman/build_test/tmp/soft-interface.c:574:10: error: unknown field name in initializer
/home/batman/build_test/tmp/soft-interface.c:573:2: error: unknown field 'ndo_add_slave' specified in initializer
/home/batman/build_test/tmp/soft-interface.c:573:2: warning: initialization from incompatible pointer type [enabled by default]
/home/batman/build_test/tmp/soft-interface.c:573:2: warning: (near initialization for 'batadv_netdev_ops.ndo_do_ioctl') [enabled by default]
/home/batman/build_test/tmp/soft-interface.c:574:2: error: unknown field 'ndo_del_slave' specified in initializer
/home/batman/build_test/tmp/soft-interface.c:574:2: warning: initialization from incompatible pointer type [enabled by default]
/home/batman/build_test/tmp/soft-interface.c:574:2: warning: (near initialization for 'batadv_netdev_ops.ndo_set_config') [enabled by default]
make[2]: *** [/home/batman/build_test/tmp/soft-interface.o] Error 1
make[1]: *** [_module_/home/batman/build_test/tmp] Error 2
make: *** [all] Error 2

unused_symbols master linux-2.6.38 CONFIG_BATMAN_ADV_BLA=n CONFIG_BATMAN_ADV_DAT=y CONFIG_BATMAN_ADV_DEBUG=y CONFIG_BATMAN_ADV_NC=y:
>>>>>>>>
batadv_algo_select
batadv_dat_snoop_outgoing_arp_reply
batadv_dat_snoop_outgoing_arp_request
batadv_debugfs_add_meshif
batadv_debugfs_del_meshif
batadv_free_rcu_tt_local_entry
batadv_gw_bandwidth_set
batadv_gw_get_selected_orig
batadv_gw_is_dhcp_target
batadv_gw_out_of_range
batadv_hardif_disable_interface
batadv_hardif_enable_interface
batadv_hardif_get_by_netdev
batadv_hardif_min_mtu
batadv_is_wifi_iface
batadv_mesh_free
batadv_mesh_init
batadv_nc_init_bat_priv
batadv_routing_algo
batadv_update_min_mtu
init_module

unused_symbols master linux-2.6.38 CONFIG_BATMAN_ADV_BLA=y CONFIG_BATMAN_ADV_DAT=y CONFIG_BATMAN_ADV_DEBUG=n CONFIG_BATMAN_ADV_NC=n:
>>>>>>>>
batadv_algo_select
batadv_bla_rx
batadv_bla_tx
batadv_dat_snoop_outgoing_arp_reply
batadv_dat_snoop_outgoing_arp_request
batadv_debugfs_add_meshif
batadv_debugfs_del_meshif
batadv_free_rcu_tt_local_entry
batadv_gw_bandwidth_set
batadv_gw_get_selected_orig
batadv_gw_is_dhcp_target
batadv_gw_out_of_range
batadv_hardif_disable_interface
batadv_hardif_enable_interface
batadv_hardif_get_by_netdev
batadv_hardif_min_mtu
batadv_is_wifi_iface
batadv_mesh_free
batadv_mesh_init
batadv_routing_algo
batadv_update_min_mtu
init_module



More information about the linux-merge mailing list