Failed build next linux-3.3: CONFIG_BATMAN_ADV_DAT=n CONFIG_BATMAN_ADV_BLA=y CONFIG_BATMAN_ADV_DEBUG=n

postmaster at open-mesh.org postmaster at open-mesh.org
Wed Mar 28 16:53:05 CEST 2012


/home/batman/build_test/tmp/gen-compat-autoconf.sh /home/batman/build_test/tmp/compat-autoconf.h
/usr/bin/make -C /home/batman/build_test/linux-build/linux-3.3 M=/home/batman/build_test/tmp PWD=/home/batman/build_test/tmp modules
make[1]: Entering directory `/home/batman/build_test/linux-build/linux-3.3'
  CC [M]  /home/batman/build_test/tmp/compat.o
  CC [M]  /home/batman/build_test/tmp/bat_debugfs.o
  CC [M]  /home/batman/build_test/tmp/bat_iv_ogm.o
  CC [M]  /home/batman/build_test/tmp/bat_sysfs.o
  CC [M]  /home/batman/build_test/tmp/bitarray.o
  CC [M]  /home/batman/build_test/tmp/gateway_client.o
  CC [M]  /home/batman/build_test/tmp/gateway_common.o
  CC [M]  /home/batman/build_test/tmp/hard-interface.o
  CC [M]  /home/batman/build_test/tmp/hash.o
  CC [M]  /home/batman/build_test/tmp/icmp_socket.o
  CC [M]  /home/batman/build_test/tmp/main.o
  CC [M]  /home/batman/build_test/tmp/originator.o
  CC [M]  /home/batman/build_test/tmp/ring_buffer.o
  CC [M]  /home/batman/build_test/tmp/routing.o
  CC [M]  /home/batman/build_test/tmp/send.o
  CC [M]  /home/batman/build_test/tmp/soft-interface.o
/home/batman/build_test/tmp/soft-interface.c:802:9: error: undefined identifier 'eth_hw_addr_random'
/home/batman/build_test/tmp/soft-interface.c: In function ‘interface_setup’:
/home/batman/build_test/tmp/soft-interface.c:802: error: implicit declaration of function ‘eth_hw_addr_random’
make[2]: *** [/home/batman/build_test/tmp/soft-interface.o] Error 1
make[1]: *** [_module_/home/batman/build_test/tmp] Error 2
make[1]: Leaving directory `/home/batman/build_test/linux-build/linux-3.3'
make: *** [all] Error 2


More information about the linux-merge mailing list