Warning build master linux-2.6.30

postmaster at open-mesh.org postmaster at open-mesh.org
Sat Dec 24 00:26:14 CET 2011


/home/batman/build_test/tmp/gen-compat-autoconf.sh /home/batman/build_test/tmp/compat-autoconf.h
/usr/bin/make -C /home/batman/build_test/linux-build/linux-2.6.30 M=/home/batman/build_test/tmp PWD=/home/batman/build_test/tmp modules
make[1]: Entering directory `/home/batman/build_test/linux-build/linux-2.6.30'
  CC [M]  /home/batman/build_test/tmp/compat.o
  CC [M]  /home/batman/build_test/tmp/bat_debugfs.o
  CC [M]  /home/batman/build_test/tmp/bat_iv_ogm.o
  CC [M]  /home/batman/build_test/tmp/bat_sysfs.o
  CC [M]  /home/batman/build_test/tmp/bitarray.o
  CC [M]  /home/batman/build_test/tmp/gateway_client.o
  CC [M]  /home/batman/build_test/tmp/gateway_common.o
  CC [M]  /home/batman/build_test/tmp/hard-interface.o
  CC [M]  /home/batman/build_test/tmp/hash.o
  CC [M]  /home/batman/build_test/tmp/icmp_socket.o
  CC [M]  /home/batman/build_test/tmp/main.o
/home/batman/build_test/tmp/main.c:282:1: error: macro "__module_param_call" passed 7 arguments, but takes just 6
/home/batman/build_test/tmp/main.c:282:1: error: macro "__module_param_call" passed 7 arguments, but takes just 6
/home/batman/build_test/tmp/main.c:282: warning: data definition has no type or storage class
/home/batman/build_test/tmp/main.c:282: warning: type defaults to 'int' in declaration of '__module_param_call'
cc1: warning: unrecognized command line option "-Wno-unused-but-set-variable"
make[2]: *** [/home/batman/build_test/tmp/main.o] Error 1
make[1]: *** [_module_/home/batman/build_test/tmp] Error 2
make[1]: Leaving directory `/home/batman/build_test/linux-build/linux-2.6.30'
make: *** [all] Error 2


More information about the linux-merge mailing list